{"text_format":"1","workbook":"xlsx","n_sheets":26,"sheets":["Auto Team results","Final team results","Overall Festival","All Individuals Day 1","All Individuals Day 2","Day 1 Zones","Day 2 Zones","Bass Festival","Bass Only Day 1","Bass Only Day 2","Non-Bass Day 1","Non-Bass Day 2","Ladies Champs. ","Ladies Day 1","Ladies Day 2","Juniors ","Juniors Day 1","Juniors Day 2","Heaviest Bass","Heaviest Flat Day 1","Heaviest Flat Day 2","Heaviest Catch","Mystery Pairs","Shannock Quads","Final Individual results","Weight Point Table (qtr oz)"],"not_rendered":{"charts":0,"images":0,"macros":1,"external_links":4,"defined_names":106,"comments":0,"pivot_tables":0},"unopened":[],"bounds":{"document_bytes":16777216,"sheet_cells":100000,"rows_first":2000,"rows_last":500,"rows_between":2000,"halvings":0,"cell_chars":16384,"cell_head_chars":4096},"cells_cut":0,"cells_raw":0,"read":"whole","date_system":"1900"}

{"sheet":"Auto Team results","index":0,"n_rows":109,"n_cols":14,"rows_kept":109,"cut":false,"hidden":true,"merged":[[76,5,77,5],[76,4,77,4],[72,4,72,5],[74,4,74,5],[76,0,77,0],[76,1,77,1],[76,2,77,2],[76,3,77,3],[71,2,71,3],[38,13,39,13],[1,0,2,0],[1,1,2,1],[1,12,2,12],[1,13,2,13],[36,2,36,3],[38,0,39,0],[38,1,39,1],[38,12,39,12],[36,4,36,5],[74,8,74,9],[74,10,74,11],[36,6,36,7],[36,8,36,9],[74,6,74,7],[71,6,71,7],[71,8,71,9],[71,10,71,11]]}
["SAMF 2006 National Sea League Final  -  Day 1"]
["Team Name","Team No. ","Zone A",null,"Zone B",null,"Zone C",null,"Zone D",null,"Zone E",null,"Day 1 Points","Day 1 Position"]
[null,null,"Peg","Points & Position","Peg","Points & Position","Peg","Points & Position","Peg","Points & Position","Peg","Points & Position"]
[{"$f":"IF(ISNA(VLOOKUP(B4,#REF!,3,FALSE))=TRUE,\"\",VLOOKUP(B4,#REF!,3,FALSE))","v":{"$error":"#REF!"}},12,{"$f":"B4","v":12},{"$f":"IF(C4=\"\",\"\",VLOOKUP(C4,#REF!,7,FALSE))","v":{"$error":"#REF!"}},{"$f":"IF(C4=\"\",\"\",IF((C4+NpZ+ZP)>2*NpZ,(((C4+NpZ+ZP)-2*NpZ)+NpZ),(C4+NpZ+ZP)))","v":{"$error":"#REF!"}},{"$f":"IF(E4=\"\",\"\",VLOOKUP(E4,#REF!,7,FALSE))","v":{"$error":"#REF!"}},{"$f":"IF(E4=\"\",\"\",IF((E4+NpZ+ZP)>3*NpZ,(((E4+NpZ+ZP)-2*NpZ)+NpZ),(E4+NpZ+ZP)))","v":{"$error":"#REF!"}},{"$f":"IF(G4=\"\",\"\",VLOOKUP(G4,#REF!,7,FALSE))","v":{"$error":"#REF!"}},{"$f":"IF(G4=\"\",\"\",IF((G4+NpZ+ZP)>4*NpZ,(((G4+NpZ+ZP)-2*NpZ)+NpZ),(G4+NpZ+ZP)))","v":{"$error":"#REF!"}},{"$f":"IF(I4=\"\",\"\",VLOOKUP(I4,#REF!,7,FALSE))","v":{"$error":"#REF!"}},{"$f":"IF(I4=\"\",\"\",IF((I4+NpZ+ZP)>5*NpZ,(((I4+NpZ+ZP)-2*NpZ)+NpZ),(I4+NpZ+ZP)))","v":{"$error":"#REF!"}},{"$f":"IF(K4=\"\",\"\",VLOOKUP(K4,#REF!,7,FALSE))","v":{"$error":"#REF!"}},{"$f":"IF(B4=\"\",\"\",(D4+F4+H4+J4+L4))","v":{"$error":"#REF!"}},{"$f":"IF(M4=\"\",\"\",IF(M4=M3,N3,ROW()-3))","v":{"$error":"#REF!"}}]
[{"$f":"IF(ISNA(VLOOKUP(B5,#REF!,3,FALSE))=TRUE,\"\",VLOOKUP(B5,#REF!,3,FALSE))","v":{"$error":"#REF!"}},10,10,{"$f":"IF(C5=\"\",\"\",VLOOKUP(C5,#REF!,7,FALSE))","v":{"$error":"#REF!"}},{"$error":"#REF!"},{"$f":"IF(E5=\"\",\"\",VLOOKUP(E5,#REF!,7,FALSE))","v":{"$error":"#REF!"}},{"$error":"#REF!"},{"$f":"IF(G5=\"\",\"\",VLOOKUP(G5,#REF!,7,FALSE))","v":{"$error":"#REF!"}},{"$error":"#REF!"},{"$f":"IF(I5=\"\",\"\",VLOOKUP(I5,#REF!,7,FALSE))","v":{"$error":"#REF!"}},{"$error":"#REF!"},{"$f":"IF(K5=\"\",\"\",VLOOKUP(K5,#REF!,7,FALSE))","v":{"$error":"#REF!"}},{"$error":"#REF!"},{"$error":"#REF!"}]
[{"$f":"IF(ISNA(VLOOKUP(B6,#REF!,3,FALSE))=TRUE,\"\",VLOOKUP(B6,#REF!,3,FALSE))","v":{"$error":"#REF!"}},9,9,{"$f":"IF(C6=\"\",\"\",VLOOKUP(C6,#REF!,7,FALSE))","v":{"$error":"#REF!"}},{"$error":"#REF!"},{"$f":"IF(E6=\"\",\"\",VLOOKUP(E6,#REF!,7,FALSE))","v":{"$error":"#REF!"}},{"$error":"#REF!"},{"$f":"IF(G6=\"\",\"\",VLOOKUP(G6,#REF!,7,FALSE))","v":{"$error":"#REF!"}},{"$error":"#REF!"},{"$f":"IF(I6=\"\",\"\",VLOOKUP(I6,#REF!,7,FALSE))","v":{"$error":"#REF!"}},{"$error":"#REF!"},{"$f":"IF(K6=\"\",\"\",VLOOKUP(K6,#REF!,7,FALSE))","v":{"$error":"#REF!"}},{"$error":"#REF!"},{"$error":"#REF!"}]
{"$rows_left_out":104}
{"sheet":"Final team results","index":1,"n_rows":31,"n_cols":6,"rows_kept":31,"cut":false,"hidden":true,"merged":[[1,5,2,5],[1,4,2,4],[1,0,2,0],[1,1,2,1],[1,2,2,2],[1,3,2,3]]}
["SAMF 2006 National Sea League Final  -  Final Positions"]
["Team Name","Team No. ","Day 1 Points","Day 2 Points","Total Points","Overall Position"]
[]
[{"$f":"'Auto Team results'!A79","v":{"$error":"#REF!"}},{"$f":"'Auto Team results'!B79","v":12},{"$f":"'Auto Team results'!C79","v":{"$error":"#REF!"}},{"$f":"'Auto Team results'!D79","v":{"$error":"#REF!"}},{"$f":"IF(B4=\"\",\"\",(C4+D4))","v":{"$error":"#REF!"}},{"$f":"IF(E4=\"\",\"\",IF(E4=E3,F3,ROW()-3))","v":{"$error":"#REF!"}}]
[{"$f":"'Auto Team results'!A80","v":{"$error":"#REF!"}},{"$f":"'Auto Team results'!B80","v":11},{"$f":"'Auto Team results'!C80","v":{"$error":"#REF!"}},{"$f":"'Auto Team results'!D80","v":{"$error":"#REF!"}},{"$f":"IF(B5=\"\",\"\",(C5+D5))","v":{"$error":"#REF!"}},{"$f":"IF(E5=\"\",\"\",IF(E5=E4,F4,ROW()-3))","v":{"$error":"#REF!"}}]
[{"$f":"'Auto Team results'!A81","v":{"$error":"#REF!"}},{"$f":"'Auto Team results'!B81","v":9},{"$f":"'Auto Team results'!C81","v":{"$error":"#REF!"}},{"$f":"'Auto Team results'!D81","v":{"$error":"#REF!"}},{"$error":"#REF!"},{"$error":"#REF!"}]
{"$rows_left_out":26}
{"sheet":"Overall Festival","index":2,"n_rows":111,"n_cols":9,"rows_kept":111,"cut":false,"hidden":false,"merged":[[1,8,2,8],[0,1,0,3],[0,4,0,8],[1,0,2,0],[1,1,2,1],[1,2,2,2],[1,3,2,3],[1,4,2,4],[1,5,2,5],[1,6,2,6],[1,7,2,7]]}
[null,"NORTH NORFOLK BASS FESTIVAL 2017",null,null,"Overall - Final Positions"]
["Overall Number","Angler Name","Angler No","Total No. Fish","Total No. Fish Points","Day 1 Points","Day 2 Points","Total Points","Overall Position"]
[null,{"$error":"#N/A"}]
[1,"DRAYTON, Simon",37,58,1264,1,1,1.9873020000000001,1]
[2,"CLEMENT, Alby",27,52,2679,1,2,2.9731579999999997,2]
[3,"ADAMS, Stephen",4,71,2676,1,2,2.973169,3]
{"$rows_left_out":106}
{"sheet":"All Individuals Day 1","index":3,"n_rows":107,"n_cols":10,"rows_kept":107,"cut":false,"hidden":false,"merged":[[1,0,2,0],[0,0,0,3],[0,4,0,9],[1,1,2,1],[1,8,2,8],[1,9,2,9],[1,2,2,2],[1,3,2,3],[1,4,2,4],[1,5,2,5]]}
["NORTH NORFOLK BASS FESTIVAL 2017",null,null,null,"Day 1 (All Fish)"]
["Individual No.","Angler Name","Zone","Peg","No. Fish","Fish Points","Weight",null,"Day 1 Points","Day 1 Position"]
[null,null,null,null,null,null,"lbs","oz"]
[1,"CLEMENT, Alby","G",95,27,2469,51,7,1,1]
[2,"ADAMS, Stephen","E",64,46,2404,50,1.3333333333333333,1,2]
[3,"SMITH, George","H",107,37,1986,41,6,1,3]
{"$rows_left_out":102}
{"sheet":"All Individuals Day 2","index":4,"n_rows":103,"n_cols":10,"rows_kept":103,"cut":false,"hidden":false,"merged":[[0,0,0,3],[0,4,0,9],[1,0,2,0],[1,1,2,1],[1,2,2,2],[1,3,2,3],[1,4,2,4],[1,5,2,5],[1,8,2,8],[1,9,2,9]]}
["NORTH NORFOLK BASS FESTIVAL 2017",null,null,null,"Day 2 (All Fish)"]
["Individual No.","Angler Name","Zone","Peg","No. Fish","Fish Points","Weight",null,"Day 2 Points","Day 2 Position"]
[null,null,null,null,null,null,"lbs","oz"]
[1,"BOWELL, Ian","F",78,25,912,19,0,1,1]
[2,"DRAYTON, Simon","H",120,30,527,10,15.666666666666666,1,2]
[3,"SPALL, Chris","E",63,32,490,10,3.3333333333333335,1,3]
{"$rows_left_out":98}
{"sheet":"Day 1 Zones","index":5,"n_rows":262,"n_cols":10,"rows_kept":262,"cut":false,"hidden":false,"merged":[[231,1,231,4],[231,5,231,9],[232,0,233,0],[232,1,233,1],[232,2,233,2],[232,3,233,3],[232,4,233,4],[232,7,233,7],[232,8,233,8],[232,9,233,9],[198,1,198,4],[198,5,198,9],[199,0,200,0],[199,1,200,1],[199,2,200,2],[199,3,200,3],[199,4,200,4],[199,7,200,7],[199,8,200,8],[199,9,200,9],[165,1,165,4],[165,5,165,9],[166,0,167,0],[166,1,167,1],[166,2,167,2],[166,3,167,3],[166,4,167,4],[166,7,167,7],[166,8,167,8],[166,9,167,9],[132,1,132,4],[132,5,132,9],[133,0,134,0],[133,1,134,1],[133,2,134,2],[133,3,134,3],[133,4,134,4],[133,7,134,7],[133,8,134,8],[133,9,134,9],[99,1,99,4],[99,5,99,9],[100,0,101,0],[100,1,101,1],[100,2,101,2],[100,3,101,3],[100,4,101,4],[100,7,101,7],[100,8,101,8],[100,9,101,9],[66,1,66,4],[66,5,66,9],[67,0,68,0],[67,1,68,1],[67,2,68,2],[67,3,68,3],[67,4,68,4],[67,7,68,7],[67,8,68,8],[67,9,68,9],[33,1,33,4],[33,5,33,9],[34,0,35,0],[34,1,35,1],[34,2,35,2],[34,3,35,3],[34,4,35,4],[34,7,35,7],[34,8,35,8],[34,9,35,9],[0,1,0,4],[0,5,0,9],[1,0,2,0],[1,1,2,1],[1,2,2,2],[1,3,2,3],[1,4,2,4],[1,7,2,7],[1,8,2,8],[1,9,2,9]]}
[null,"NORTH NORFOLK BASS FESTIVAL 2017",null,null,null,"Day 1  ZONE A"]
["Zone Number","Peg","Name","No. Fish","Total Weight Points","Weight",null,"Optional Pools","Day 1 Points ","Zone Position"]
[null,null,null,null,null,"(lbs)","(ozs)"]
[1,4,"ADAMS, Lee",28,484,10,1.3333333333333333,"X",1,1]
[2,7,"THOMAS, Tony",17,418,8,11.333333333333334,"X",2,2]
[3,15,"MICKELSEN, Jon",12,341,7,1.6666666666666667,"X",3,3]
{"$rows_left_out":257}
{"sheet":"Day 2 Zones","index":6,"n_rows":262,"n_cols":10,"rows_kept":262,"cut":false,"hidden":false,"merged":[[231,1,231,4],[231,5,231,9],[232,0,233,0],[232,1,233,1],[232,2,233,2],[232,3,233,3],[232,4,233,4],[232,7,233,7],[232,8,233,8],[232,9,233,9],[198,1,198,4],[198,5,198,9],[199,0,200,0],[199,1,200,1],[199,2,200,2],[199,3,200,3],[199,4,200,4],[199,7,200,7],[199,8,200,8],[199,9,200,9],[165,1,165,4],[165,5,165,9],[166,0,167,0],[166,1,167,1],[166,2,167,2],[166,3,167,3],[166,4,167,4],[166,7,167,7],[166,8,167,8],[166,9,167,9],[132,1,132,4],[132,5,132,9],[133,0,134,0],[133,1,134,1],[133,2,134,2],[133,3,134,3],[133,4,134,4],[133,7,134,7],[133,8,134,8],[133,9,134,9],[99,1,99,4],[99,5,99,9],[100,0,101,0],[100,1,101,1],[100,2,101,2],[100,3,101,3],[100,4,101,4],[100,7,101,7],[100,8,101,8],[100,9,101,9],[66,1,66,4],[66,5,66,9],[67,0,68,0],[67,1,68,1],[67,2,68,2],[67,3,68,3],[67,4,68,4],[67,7,68,7],[67,8,68,8],[67,9,68,9],[33,1,33,4],[33,5,33,9],[34,0,35,0],[34,1,35,1],[34,2,35,2],[34,3,35,3],[34,4,35,4],[34,7,35,7],[34,8,35,8],[34,9,35,9],[0,1,0,4],[0,5,0,9],[1,0,2,0],[1,1,2,1],[1,2,2,2],[1,3,2,3],[1,4,2,4],[1,7,2,7],[1,8,2,8],[1,9,2,9]]}
[null,"NORTH NORFOLK BASS FESTIVAL 2017",null,null,null,"Day 2  ZONE A"]
["Zone Number","Peg","Name","No. Fish","Total Weight Points","Weight",null,"Optional Pools","Day 2 Points ","Zone Position"]
[null,null,null,null,null,"(lbs)","(ozs)"]
[1,8,"PICKARD, Colin",15,211,4,6.333333333333333,"X",1,1]
[2,9,"CLEMENT, Alby",25,210,4,6,"X",2,2]
[3,3,"SMITH, George",17,177,3,11,"X",3,3]
{"$rows_left_out":257}
{"sheet":"Bass Festival","index":7,"n_rows":88,"n_cols":8,"rows_kept":88,"cut":false,"hidden":false,"merged":[[1,7,2,7],[0,1,0,2],[0,3,0,7],[1,0,2,0],[1,1,2,1],[1,2,2,2],[1,3,2,3],[1,4,2,4],[1,5,2,5],[1,6,2,6]]}
[null,"BASS FESTIVAL 2017",null,"Overall - Final Positions"]
["Overall Number","Angler Name","Total No. Fish","Total No. Fish Points","Day 1 Points","Day 2 Points","Total Points","Overall Position"]
[null,{"$error":"#N/A"}]
[1,"DRAYTON, Simon",58,1264,1.0000013563368055,1.0000018964536317,1.9873052527904371,1]
[2,"CLEMENT, Alby",52,2679,1.0000004049779894,2.0000047562425682,2.9731631612205573,2]
[3,"ADAMS, Stephen",71,2676,1.0000004158937974,2.0000036730945823,2.9731730889883798,3]
{"$rows_left_out":83}
{"sheet":"Bass Only Day 1","index":8,"n_rows":33,"n_cols":9,"rows_kept":33,"cut":false,"hidden":false,"merged":[[1,8,2,8],[0,0,0,3],[0,4,0,8],[1,0,2,0],[1,1,2,1],[1,2,2,2],[1,3,2,3],[1,4,2,4],[1,5,2,5]]}
["BASS FESTIVAL 2017",null,null,null,"Day 1 (Bass)"]
["Individual No.","Angler Name","Zone","Peg","No. Fish","Fish Points","Weight",null,"Day 1 Position"]
[null,null,null,null,null,null,"lbs","oz"]
[1,"AKESTER, Jack","C",41,4,221,4,9.6666666666666661,1]
[2,"GALLACHER, Andy","C",33,4,220,4,9.3333333333333339,2]
[3,"BRADSHAW, Craig","B",23,3,166,3,7.333333333333333,3]
{"$rows_left_out":28}
{"sheet":"Bass Only Day 2","index":9,"n_rows":22,"n_cols":9,"rows_kept":22,"cut":false,"hidden":false,"merged":[[1,8,2,8],[0,4,0,8],[1,4,2,4],[1,5,2,5],[0,0,0,3],[1,0,2,0],[1,1,2,1],[1,2,2,2],[1,3,2,3]]}
["BASS FESTIVAL 2017",null,null,null,"Day 2 (Bass)"]
["Individual No.","Angler Name","Zone","Peg","No. Fish","Fish Points","Weight",null,"Day 2 Position"]
[null,null,null,null,null,null,"lbs","oz"]
[1,"BUY, Craig","B",16,1,143,2,15.666666666666666,1]
[2,"KENDRICK, Paul","D",50,2,126,2,10,2]
[3,"PINDER, Mark","D",51,2,99,2,1,3]
{"$rows_left_out":17}
{"sheet":"Non-Bass Day 1","index":10,"n_rows":92,"n_cols":9,"rows_kept":92,"cut":false,"hidden":false,"merged":[[1,8,2,8],[0,0,0,3],[0,4,0,8],[1,0,2,0],[1,1,2,1],[1,2,2,2],[1,3,2,3],[1,4,2,4],[1,5,2,5]]}
["BASS FESTIVAL 2017",null,null,null,"Day 1 (Non-Bass)"]
["Individual No.","Angler Name","Zone","Peg","No. Fish","Fish Points","Weight",null,"Day 1 Position"]
[null,null,null,null,null,null,"lbs","oz"]
[1,"CLEMENT, Alby","G",95,27,2469,51,7,1]
[2,"ADAMS, Stephen","E",64,46,2404,50,1.3333333333333333,2]
[3,"SMITH, George","H",107,36,1970,41,0.66666666666666663,3]
{"$rows_left_out":87}
{"sheet":"Non-Bass Day 2","index":11,"n_rows":90,"n_cols":9,"rows_kept":90,"cut":false,"hidden":false,"merged":[[1,8,2,8],[0,4,0,8],[1,4,2,4],[1,5,2,5],[0,0,0,3],[1,0,2,0],[1,1,2,1],[1,2,2,2],[1,3,2,3]]}
["BASS FESTIVAL 2016",null,null,null,"Day 2 (Non-Bass)"]
["Individual No.","Angler Name","Zone","Peg","No. Fish","Fish Points","Weight",null,"Day 2 Position"]
[null,null,null,null,null,null,"lbs","oz"]
[1,"BOWELL, Ian","F",78,23,878,18,4.666666666666667,1]
[2,"DRAYTON, Simon","H",120,30,527,10,15.666666666666666,2]
[3,"SPALL, Chris","E",63,31,472,9,13.333333333333334,3]
{"$rows_left_out":85}
{"sheet":"Ladies Champs. ","index":12,"n_rows":8,"n_cols":8,"rows_kept":8,"cut":false,"hidden":false,"merged":[[1,7,2,7],[0,1,0,2],[0,3,0,7],[1,0,2,0],[1,1,2,1],[1,2,2,2],[1,3,2,3],[1,4,2,4],[1,5,2,5],[1,6,2,6]]}
[null,"UK LADIES CHAMPIONSHIPS 2017",null,"Overall - Final Positions"]
["Overall Number","Angler Name","Total No. Fish","Total No. Fish Points","Day 1 Points","Day 2 Points","Total Points","Overall Position"]
[null,{"$error":"#N/A"}]
[1,"LAWN, Kimberley",38,505,2.0000030102347983,1.0000057743388382,2.9949207845736363,1]
[2,"ADAMS, Becky",24,478,1.0000029663028003,2.0000070861678005,3.0000100524706008,2]
[3,"SMITH, Adele",26,462,1.0000023243921714,5.0000312109862675,5.9953875353784385,3]
{"$rows_left_out":3}
{"sheet":"Ladies Day 1","index":13,"n_rows":10,"n_cols":8,"rows_kept":10,"cut":false,"hidden":false,"merged":[[0,0,0,1],[0,2,0,7],[1,0,2,0],[1,1,2,1],[1,2,2,2],[1,3,2,3],[1,6,2,6],[1,7,2,7]]}
["UK LADIES CHAMPIONSHIPS 2017",null,"Day 1 (Individuals)"]
["Angler Name","Peg","No. Fish","Fish Points","Weight",null,"Day 1 Points","Day 1 Position"]
[null,null,null,null,"lbs","oz"]
["SMITH, Adele",94,22,430,8,15.333333333333334,1,1]
["ADAMS, Becky",89,12,337,7,0.33333333333333331,2,2]
["LAWN, Kimberley",85,20,332,6,14.666666666666666,3,3]
{"$rows_left_out":5}
{"sheet":"Ladies Day 2","index":14,"n_rows":8,"n_cols":8,"rows_kept":8,"cut":false,"hidden":false,"merged":[[0,0,0,1],[0,2,0,7],[1,0,2,0],[1,1,2,1],[1,2,2,2],[1,3,2,3],[1,6,2,6],[1,7,2,7]]}
["UK LADIES CHAMPIONSHIPS 2017",null,"Day 2 (Individuals)"]
["Angler Name","Peg","No. Fish","Fish Points","Weight",null,"Day 2 Points","Day 2 Position"]
[null,null,null,null,"lbs","oz"]
["LAWN, Kimberley",2,18,173,3,9.6666666666666661,1,1]
["ADAMS, Becky",14,12,141,2,15,2,2]
["FRARY, June",54,5,44,0,14.666666666666666,3,3]
{"$rows_left_out":3}
{"sheet":"Juniors ","index":15,"n_rows":9,"n_cols":9,"rows_kept":9,"cut":false,"hidden":false,"merged":[[1,0,2,0],[1,1,2,1],[1,2,2,2],[1,3,2,3],[1,4,2,4],[0,1,0,3],[0,4,0,8],[1,5,2,5],[1,6,2,6],[1,7,2,7],[1,8,2,8]]}
[null,"NORTH NORFOLK JUNIORS TOURNAMENT 2017",null,null,"Overall - Final Positions"]
["Overall Number","Angler Name","Angler No","Total No. Fish","Total No. Fish Points","Day 1 Points","Day 2 Points","Total Points","Overall Position"]
[null,{"$error":"#N/A"}]
[1,"MOLLOY, Adam",75,59,623,2,1,3,1]
[2,"BRADSHAW, Daine",14,23,573,1,4,5,2]
[3,"BRIERLEY, Luke",15,25,343,4,3,7,3]
{"$rows_left_out":4}
{"sheet":"Juniors Day 1","index":16,"n_rows":9,"n_cols":9,"rows_kept":9,"cut":false,"hidden":false,"merged":[[0,1,0,3],[0,4,0,8],[1,4,2,4],[1,5,2,5],[1,0,2,0],[1,1,2,1],[1,2,2,2],[1,3,2,3],[1,8,2,8]]}
[null,"NORTH NORFOLK JUNIORS TOURNAMENT 2017",null,null,"Day 1 (Juniors)"]
["Individual No.","Angler Name","Zone","Peg","No. Fish","Fish Points","Weight",null,"Day 1 Position"]
[null,null,null,null,null,null,"lbs","oz"]
[1,"BRADSHAW, Daine","B",24,15,476,9,14.666666666666666,1]
[2,"MOLLOY, Adam","B",18,24,299,6,3.6666666666666665,2]
[3,"BROWN, Danny","A",10,13,247,5,2.3333333333333335,3]
{"$rows_left_out":4}
{"sheet":"Juniors Day 2","index":17,"n_rows":9,"n_cols":9,"rows_kept":9,"cut":false,"hidden":false,"merged":[[0,1,0,3],[0,4,0,8],[1,4,2,4],[1,5,2,5],[1,0,2,0],[1,1,2,1],[1,2,2,2],[1,3,2,3],[1,8,2,8]]}
[null,"NORTH NORFOLK JUNIORS TOURNAMENT 2017",null,null,"Day 2 (Juniors)"]
["Individual No.","Angler Name","Zone","Peg","No. Fish","Fish Points","Weight",null,"Day 2 Position"]
[null,null,null,null,null,null,"lbs","oz"]
[1,"MOLLOY, Adam","G",93,35,324,6,12,1]
[2,"TOPPING, Jack","G",101,11,139,2,14.333333333333334,2]
[3,"BRIERLEY, Luke","F",76,11,108,2,4,3]
{"$rows_left_out":4}
{"sheet":"Heaviest Bass","index":18,"n_rows":31,"n_cols":10,"rows_kept":31,"cut":false,"hidden":false,"merged":[[29,2,30,9],[0,2,0,4],[0,5,0,9],[1,9,2,9],[1,0,2,0],[1,1,2,1],[1,2,2,2],[1,3,2,3],[1,4,2,4],[1,5,2,5],[1,8,2,8]]}
[null,null,"NORTH NORFOLK BASS FESTIVAL 2017",null,null,"Overall Heaviest Bass"]
["Overall Number","Individual No.","Angler Name","Angler No.","Peg","Fish Points","Weight",null,"Day","Position"]
[null,null,null,null,null,null,"lbs","oz"]
[1,1,"GALLACHER, Andy","43-1",33,166,3,7.333333333333333,"Day 1",1]
[2,2,"AKESTER, Jack","5-1",41,166,3,7.333333333333333,"Day 1",1]
[3,3,"BUY, Craig","23-2",16,143,2,15.666666666666666,"Day 2",3]
{"$rows_left_out":26}
{"sheet":"Heaviest Flat Day 1","index":19,"n_rows":23,"n_cols":8,"rows_kept":23,"cut":false,"hidden":false,"merged":[[1,0,2,0],[1,1,2,1],[1,2,2,2],[1,3,2,3],[0,1,0,2],[0,3,0,7],[1,6,2,6],[1,7,2,7]]}
[null,"BASS FESTIVAL 2017",null,"Day 1 - Heaviest Flat"]
["Individual No.","Angler Name","Peg","Fish Points","Weight",null,"Species","Day 1 Position"]
[null,null,null,null,"lbs","oz"]
[1,"RANDELL, Henry",11,60,1,4,"Flounder",1]
[2,"CARTER, John",45,56,1,2.6666666666666665,"Flounder",2]
[3,"SMITH, John",50,52,1,1.3333333333333333,"Flounder",3]
{"$rows_left_out":18}
{"sheet":"Heaviest Flat Day 2","index":20,"n_rows":13,"n_cols":8,"rows_kept":13,"cut":false,"hidden":false,"merged":[[1,0,2,0],[1,1,2,1],[1,2,2,2],[1,3,2,3],[0,1,0,2],[0,3,0,7],[1,6,2,6],[1,7,2,7]]}
[null,"BASS FESTIVAL 2017",null,"Day 2 - Heaviest Flat"]
["Individual No.","Angler Name","Peg","Fish Points","Weight",null,"Species","Day 2 Position"]
[null,null,null,null,"lbs","oz"]
[1,"GIBBS, Tom",74,48,1,0,"Flounder",1]
[2,"LOKE, Peter",72,44,0,14.666666666666666,"Dab",2]
[3,"PEARSON, Luke",65,40,0,13.333333333333334,"Flounder",3]
{"$rows_left_out":8}
{"sheet":"Heaviest Catch","index":21,"n_rows":151,"n_cols":10,"rows_kept":151,"cut":false,"hidden":false,"merged":[[0,2,0,4],[0,5,0,9],[1,0,2,0],[1,1,2,1],[1,2,2,2],[1,3,2,3],[1,4,2,4],[1,5,2,5],[1,8,2,8],[1,9,2,9]]}
[null,null,"NORTH NORFOLK BASS FESTIVAL 2017",null,null,"Overall Heaviest Catch"]
["Overall Number","Individual No.","Angler Name","Angler No.","Peg","Fish Points","Weight",null,"Day","Position"]
[null,null,null,null,null,null,"lbs","oz"]
[3,3,"CLEMENT, Alby","27-1",95,2469,51,7,"Day 1",1]
[4,4,"ADAMS, Stephen","4-1",64,2404,50,1.3333333333333333,"Day 1",2]
[5,5,"SMITH, George","93-1",107,1986,41,6,"Day 1",3]
{"$rows_left_out":146}
{"sheet":"Mystery Pairs","index":22,"n_rows":48,"n_cols":10,"rows_kept":48,"cut":false,"hidden":false,"merged":[[1,9,2,9],[0,0,0,2],[1,6,2,6],[0,3,0,9],[1,0,2,0],[1,1,2,1],[1,2,2,2],[1,5,2,5],[1,3,2,3],[1,4,2,4]]}
["BASS FESTIVAL MYSTERY PAIRS          2017",null,null,"Overall (Pairs)"]
["Overall Position","Team No.","Team Name","Day 1 Zone Points","Day 2 Zone Points","Total No. Fish","Total Fish Points","Total Weight",null,"Total Zone Points"]
[null,null,null,null,null,null,null,"lbs","oz"]
[1,1,"CLEMENT, Alby & SPALL, Chris",9.9725356999999999,2.9929943000000003,100,3446,71,12.666666666666666,12.965530000000001]
[2,9,"BURT, Richard & HADDOCK, Roy",10.9777646,4.9935156000000003,98,2871,59,13,15.971280200000001]
[3,19,"LAY-FLURRIE, Matt & GALLACHER, Andy",10.980645600000001,5.9947344999999999,99,2461,51,4.333333333333333,16.975380100000002]
{"$rows_left_out":43}
{"sheet":"Shannock Quads","index":23,"n_rows":14,"n_cols":8,"rows_kept":14,"cut":false,"hidden":false,"merged":[[0,1,0,3],[0,4,0,7],[1,5,2,5],[1,0,2,0],[1,1,2,1],[1,2,2,2],[1,3,2,3],[1,4,2,4]]}
[null,"SHANNOCK QUADS 2017",null,null,"Overall (Teams)"]
["Team Count","Overall Position","Team No.","Team Name","No. Fish","Fish Points","Weight"]
[null,null,null,null,null,null,"lbs","oz"]
[1,1,2,"BREAKAWAY",218,7334,152,12.666666666666666]
[2,2,7,"ANYFISH/ASSO",217,6780,141,4]
[3,3,12,"IPSWICH SEA ANGLERS",169,6292,131,1.3333333333333333]
{"$rows_left_out":9}
{"sheet":"Final Individual results","index":24,"n_rows":103,"n_cols":17,"rows_kept":103,"cut":false,"hidden":true,"merged":[[1,16,2,16],[1,10,2,10],[1,7,2,7],[1,6,2,6],[1,0,2,0],[1,4,2,4],[1,5,2,5],[1,1,2,1],[1,2,2,2],[1,3,2,3],[0,0,0,7],[1,15,2,15],[1,11,2,11],[1,12,2,12],[1,13,2,13],[1,14,2,14]]}
["HSAC North Norfolk Bass Festival 2013  -  Final Positions ",null,null,null,null,null,null,null,null,null,"Individuals data extraction calculations"]
["Angler Name","Angler No","Total No. Fish","Total No. Fish Points","Day 1 Points","Day 2 Points","Total Points","Overall Position",null,null,"Overall Position","Angler No","Total No. Fish","Total No. Fish Points","Day 1 Points","Day 2 Points","Total Points"]
[]
[{"$f":"VLOOKUP($B4,#REF!,2,FALSE)","v":{"$error":"#N/A"}},{"$f":"VLOOKUP($H4,$K$4:$Q$300,2,FALSE)","v":{"$error":"#N/A"}},{"$f":"VLOOKUP($H4,$K$4:$Q$300,3,FALSE)","v":{"$error":"#N/A"}},{"$f":"VLOOKUP($H4,$K$4:$Q$300,4,FALSE)","v":{"$error":"#N/A"}},{"$f":"VLOOKUP($H4,$K$4:$Q$300,5,FALSE)","v":{"$error":"#N/A"}},{"$f":"VLOOKUP($H4,$K$4:$Q$300,6,FALSE)","v":{"$error":"#N/A"}},{"$f":"VLOOKUP($H4,$K$4:$Q$300,7,FALSE)","v":{"$error":"#N/A"}},{"$f":"IF(ISERROR(H3+1)=TRUE,1,H3+1)","v":1},null,null,{"$f":"IF(Q4=NpZ*NoZ*2,NpZ*NoZ,RANK(Q4,Q$4:Q$300,1))","v":{"$error":"#REF!"}},1,{"$f":"IF(ISNA(VLOOKUP($L4,'All Individuals Day 1'!$C$3:$F$254,4,FALSE)+VLOOKUP($L4,#REF!,4,FALSE))=TRUE,\"\",VLOOKUP($L4,'All Individuals Day 1'!$C$3:$F$254,4,FALSE)+VLOOKUP($L4,#REF!,4,FALSE))","v":""},{"$f":"IF(ISNA(VLOOKUP($L4,'All Individuals Day 1'!$C$3:$F$254,5,FALSE)+VLOOKUP($L4,#REF!,5,FALSE))=TRUE,\"\",VLOOKUP($L4,'All Individuals Day 1'!$C$3:$F$254,5,FALSE)+VLOOKUP($L4,#REF!,5,FALSE))","v":""},{"$f":"IF(ISNA(VLOOKUP($L4,'All Individuals Day 1'!$C$3:$J$254,8,FALSE))=TRUE,\"\",VLOOKUP($L4,'All Individuals Day 1'!$C$3:$J$254,8,FALSE))","v":""},{"$f":"IF(ISNA(VLOOKUP($L4,#REF!,8,FALSE))=TRUE,\"\",VLOOKUP($L4,#REF!,8,FALSE))","v":{"$error":"#REF!"}},{"$f":"IF(OR(M4=\"\",M4=0),NpZ*2,(O4+P4)-N4/100000-M4/1000000)","v":{"$error":"#REF!"}}]
[{"$f":"VLOOKUP($B5,#REF!,2,FALSE)","v":{"$error":"#N/A"}},{"$error":"#N/A"},{"$error":"#N/A"},{"$error":"#N/A"},{"$error":"#N/A"},{"$error":"#N/A"},{"$error":"#N/A"},{"$f":"IF(ISERROR(H4+1)=TRUE,1,H4+1)","v":2},null,null,{"$error":"#REF!"},2,{"$f":"IF(ISNA(VLOOKUP($L5,'All Individuals Day 1'!$C$3:$F$254,4,FALSE)+VLOOKUP($L5,#REF!,4,FALSE))=TRUE,\"\",VLOOKUP($L5,'All Individuals Day 1'!$C$3:$F$254,4,FALSE)+VLOOKUP($L5,#REF!,4,FALSE))","v":""},{"$f":"IF(ISNA(VLOOKUP($L5,'All Individuals Day 1'!$C$3:$F$254,5,FALSE)+VLOOKUP($L5,#REF!,5,FALSE))=TRUE,\"\",VLOOKUP($L5,'All Individuals Day 1'!$C$3:$F$254,5,FALSE)+VLOOKUP($L5,#REF!,5,FALSE))","v":""},{"$f":"IF(ISNA(VLOOKUP($L5,'All Individuals Day 1'!$C$3:$J$254,8,FALSE))=TRUE,\"\",VLOOKUP($L5,'All Individuals Day 1'!$C$3:$J$254,8,FALSE))","v":""},{"$f":"IF(ISNA(VLOOKUP($L5,#REF!,8,FALSE))=TRUE,\"\",VLOOKUP($L5,#REF!,8,FALSE))","v":{"$error":"#REF!"}},{"$error":"#REF!"}]
[{"$f":"VLOOKUP($B6,#REF!,2,FALSE)","v":{"$error":"#N/A"}},{"$error":"#N/A"},{"$error":"#N/A"},{"$error":"#N/A"},{"$error":"#N/A"},{"$error":"#N/A"},{"$error":"#N/A"},3,null,null,{"$error":"#REF!"},3,{"$f":"IF(ISNA(VLOOKUP($L6,'All Individuals Day 1'!$C$3:$F$254,4,FALSE)+VLOOKUP($L6,#REF!,4,FALSE))=TRUE,\"\",VLOOKUP($L6,'All Individuals Day 1'!$C$3:$F$254,4,FALSE)+VLOOKUP($L6,#REF!,4,FALSE))","v":""},{"$f":"IF(ISNA(VLOOKUP($L6,'All Individuals Day 1'!$C$3:$F$254,5,FALSE)+VLOOKUP($L6,#REF!,5,FALSE))=TRUE,\"\",VLOOKUP($L6,'All Individuals Day 1'!$C$3:$F$254,5,FALSE)+VLOOKUP($L6,#REF!,5,FALSE))","v":""},{"$f":"IF(ISNA(VLOOKUP($L6,'All Individuals Day 1'!$C$3:$J$254,8,FALSE))=TRUE,\"\",VLOOKUP($L6,'All Individuals Day 1'!$C$3:$J$254,8,FALSE))","v":""},{"$f":"IF(ISNA(VLOOKUP($L6,#REF!,8,FALSE))=TRUE,\"\",VLOOKUP($L6,#REF!,8,FALSE))","v":{"$error":"#REF!"}},{"$error":"#REF!"}]
{"$rows_left_out":98}
{"sheet":"Weight Point Table (qtr oz)","index":25,"n_rows":671,"n_cols":4,"rows_kept":671,"cut":false,"hidden":true,"merged":[]}
["Species","Length","Lookup","Weight Points"]
["b",18,{"$f":"CONCATENATE(A2,B2)","v":"b18"},10]
["b",19,{"$f":"CONCATENATE(A3,B3)","v":"b19"},13]
["b",20,"b20",14]
["b",21,"b21",15]
["b",22,"b22",16]
{"$rows_left_out":665}