{"text_format":"1","workbook":"xlsx","n_sheets":33,"sheets":["Auto Team results","Final team results","Winners Detail ","Winners table","Nth Nfk Bass Fest. (ALL)","Overall Heaviest Bass","Ladies Champs. Ind. result","Juniors Ind. result","Shannock Quads Overall","Mystery Pairs Overall","SAMF Qualifiers","Day 1 Zone results (All))","Day 2 Zone results (All)","Pairs list","All Individuals Day 1 (ALL)","All Individuals Day 2 (ALL)","Bass Festival Day 1 (Bass)","Bass Festival Day 2 (Bass)","Bass Festival Day 1 (Flattie)","Bass Festival Day 2 (Flattie)","Ladies Day 1","Ladies Day 2","Juniors Day 1","Juniors Day 2","Shannock Quads Day 1","Shannock Quads Day 2","All Day 1 Heaviest Bass","All Day 2 Heaviest Bass","Bass Fest. Day 1 Heaviest Flat","Bass Fest. Day 2 Heaviest Flat","Final Individual results","Weight Point Table (qtr oz)","Past Winners"],"not_rendered":{"charts":0,"images":2,"macros":1,"external_links":20,"defined_names":197,"comments":0,"pivot_tables":0},"unopened":[],"bounds":{"document_bytes":16777216,"sheet_cells":100000,"rows_first":2000,"rows_last":500,"rows_between":2000,"halvings":0,"cell_chars":16384,"cell_head_chars":4096},"cells_cut":0,"cells_raw":0,"read":"whole","date_system":"1900"}

{"sheet":"Auto Team results","index":0,"n_rows":109,"n_cols":14,"rows_kept":109,"cut":false,"hidden":true,"merged":[[76,5,77,5],[76,4,77,4],[72,4,72,5],[74,4,74,5],[76,0,77,0],[76,1,77,1],[76,2,77,2],[76,3,77,3],[71,2,71,3],[38,13,39,13],[1,0,2,0],[1,1,2,1],[1,12,2,12],[1,13,2,13],[36,2,36,3],[38,0,39,0],[38,1,39,1],[38,12,39,12],[36,4,36,5],[74,8,74,9],[74,10,74,11],[36,6,36,7],[36,8,36,9],[74,6,74,7],[71,6,71,7],[71,8,71,9],[71,10,71,11]]}
["SAMF 2006 National Sea League Final  -  Day 1"]
["Team Name","Team No. ","Zone A",null,"Zone B",null,"Zone C",null,"Zone D",null,"Zone E",null,"Day 1 Points","Day 1 Position"]
[null,null,"Peg","Points & Position","Peg","Points & Position","Peg","Points & Position","Peg","Points & Position","Peg","Points & Position"]
[{"$f":"IF(ISNA(VLOOKUP(B4,#REF!,3,FALSE))=TRUE,\"\",VLOOKUP(B4,#REF!,3,FALSE))","v":{"$error":"#REF!"}},12,{"$f":"B4","v":12},{"$f":"IF(C4=\"\",\"\",VLOOKUP(C4,#REF!,7,FALSE))","v":{"$error":"#REF!"}},{"$f":"IF(C4=\"\",\"\",IF((C4+NpZ+ZP)>2*NpZ,(((C4+NpZ+ZP)-2*NpZ)+NpZ),(C4+NpZ+ZP)))","v":{"$error":"#REF!"}},{"$f":"IF(E4=\"\",\"\",VLOOKUP(E4,#REF!,7,FALSE))","v":{"$error":"#REF!"}},{"$f":"IF(E4=\"\",\"\",IF((E4+NpZ+ZP)>3*NpZ,(((E4+NpZ+ZP)-2*NpZ)+NpZ),(E4+NpZ+ZP)))","v":{"$error":"#REF!"}},{"$f":"IF(G4=\"\",\"\",VLOOKUP(G4,#REF!,7,FALSE))","v":{"$error":"#REF!"}},{"$f":"IF(G4=\"\",\"\",IF((G4+NpZ+ZP)>4*NpZ,(((G4+NpZ+ZP)-2*NpZ)+NpZ),(G4+NpZ+ZP)))","v":{"$error":"#REF!"}},{"$f":"IF(I4=\"\",\"\",VLOOKUP(I4,#REF!,7,FALSE))","v":{"$error":"#REF!"}},{"$f":"IF(I4=\"\",\"\",IF((I4+NpZ+ZP)>5*NpZ,(((I4+NpZ+ZP)-2*NpZ)+NpZ),(I4+NpZ+ZP)))","v":{"$error":"#REF!"}},{"$f":"IF(K4=\"\",\"\",VLOOKUP(K4,#REF!,7,FALSE))","v":{"$error":"#REF!"}},{"$f":"IF(B4=\"\",\"\",(D4+F4+H4+J4+L4))","v":{"$error":"#REF!"}},{"$f":"IF(M4=\"\",\"\",IF(M4=M3,N3,ROW()-3))","v":{"$error":"#REF!"}}]
[{"$f":"IF(ISNA(VLOOKUP(B5,#REF!,3,FALSE))=TRUE,\"\",VLOOKUP(B5,#REF!,3,FALSE))","v":{"$error":"#REF!"}},10,10,{"$f":"IF(C5=\"\",\"\",VLOOKUP(C5,#REF!,7,FALSE))","v":{"$error":"#REF!"}},{"$error":"#REF!"},{"$f":"IF(E5=\"\",\"\",VLOOKUP(E5,#REF!,7,FALSE))","v":{"$error":"#REF!"}},{"$error":"#REF!"},{"$f":"IF(G5=\"\",\"\",VLOOKUP(G5,#REF!,7,FALSE))","v":{"$error":"#REF!"}},{"$error":"#REF!"},{"$f":"IF(I5=\"\",\"\",VLOOKUP(I5,#REF!,7,FALSE))","v":{"$error":"#REF!"}},{"$error":"#REF!"},{"$f":"IF(K5=\"\",\"\",VLOOKUP(K5,#REF!,7,FALSE))","v":{"$error":"#REF!"}},{"$error":"#REF!"},{"$error":"#REF!"}]
[{"$f":"IF(ISNA(VLOOKUP(B6,#REF!,3,FALSE))=TRUE,\"\",VLOOKUP(B6,#REF!,3,FALSE))","v":{"$error":"#REF!"}},9,9,{"$f":"IF(C6=\"\",\"\",VLOOKUP(C6,#REF!,7,FALSE))","v":{"$error":"#REF!"}},{"$error":"#REF!"},{"$f":"IF(E6=\"\",\"\",VLOOKUP(E6,#REF!,7,FALSE))","v":{"$error":"#REF!"}},{"$error":"#REF!"},{"$f":"IF(G6=\"\",\"\",VLOOKUP(G6,#REF!,7,FALSE))","v":{"$error":"#REF!"}},{"$error":"#REF!"},{"$f":"IF(I6=\"\",\"\",VLOOKUP(I6,#REF!,7,FALSE))","v":{"$error":"#REF!"}},{"$error":"#REF!"},{"$f":"IF(K6=\"\",\"\",VLOOKUP(K6,#REF!,7,FALSE))","v":{"$error":"#REF!"}},{"$error":"#REF!"},{"$error":"#REF!"}]
[{"$f":"IF(ISNA(VLOOKUP(B7,#REF!,3,FALSE))=TRUE,\"\",VLOOKUP(B7,#REF!,3,FALSE))","v":{"$error":"#REF!"}},26,26,{"$f":"IF(C7=\"\",\"\",VLOOKUP(C7,#REF!,7,FALSE))","v":{"$error":"#REF!"}},{"$error":"#REF!"},{"$f":"IF(E7=\"\",\"\",VLOOKUP(E7,#REF!,7,FALSE))","v":{"$error":"#REF!"}},{"$error":"#REF!"},{"$f":"IF(G7=\"\",\"\",VLOOKUP(G7,#REF!,7,FALSE))","v":{"$error":"#REF!"}},{"$error":"#REF!"},{"$f":"IF(I7=\"\",\"\",VLOOKUP(I7,#REF!,7,FALSE))","v":{"$error":"#REF!"}},{"$error":"#REF!"},{"$f":"IF(K7=\"\",\"\",VLOOKUP(K7,#REF!,7,FALSE))","v":{"$error":"#REF!"}},{"$error":"#REF!"},{"$error":"#REF!"}]
[{"$f":"IF(ISNA(VLOOKUP(B8,#REF!,3,FALSE))=TRUE,\"\",VLOOKUP(B8,#REF!,3,FALSE))","v":{"$error":"#REF!"}},4,4,{"$f":"IF(C8=\"\",\"\",VLOOKUP(C8,#REF!,7,FALSE))","v":{"$error":"#REF!"}},{"$error":"#REF!"},{"$f":"IF(E8=\"\",\"\",VLOOKUP(E8,#REF!,7,FALSE))","v":{"$error":"#REF!"}},{"$error":"#REF!"},{"$f":"IF(G8=\"\",\"\",VLOOKUP(G8,#REF!,7,FALSE))","v":{"$error":"#REF!"}},{"$error":"#REF!"},{"$f":"IF(I8=\"\",\"\",VLOOKUP(I8,#REF!,7,FALSE))","v":{"$error":"#REF!"}},{"$error":"#REF!"},{"$f":"IF(K8=\"\",\"\",VLOOKUP(K8,#REF!,7,FALSE))","v":{"$error":"#REF!"}},{"$error":"#REF!"},{"$error":"#REF!"}]
[{"$f":"IF(ISNA(VLOOKUP(B9,#REF!,3,FALSE))=TRUE,\"\",VLOOKUP(B9,#REF!,3,FALSE))","v":{"$error":"#REF!"}},11,11,{"$f":"IF(C9=\"\",\"\",VLOOKUP(C9,#REF!,7,FALSE))","v":{"$error":"#REF!"}},{"$error":"#REF!"},{"$f":"IF(E9=\"\",\"\",VLOOKUP(E9,#REF!,7,FALSE))","v":{"$error":"#REF!"}},{"$error":"#REF!"},{"$f":"IF(G9=\"\",\"\",VLOOKUP(G9,#REF!,7,FALSE))","v":{"$error":"#REF!"}},{"$error":"#REF!"},{"$f":"IF(I9=\"\",\"\",VLOOKUP(I9,#REF!,7,FALSE))","v":{"$error":"#REF!"}},{"$error":"#REF!"},{"$f":"IF(K9=\"\",\"\",VLOOKUP(K9,#REF!,7,FALSE))","v":{"$error":"#REF!"}},{"$error":"#REF!"},{"$error":"#REF!"}]
[{"$f":"IF(ISNA(VLOOKUP(B10,#REF!,3,FALSE))=TRUE,\"\",VLOOKUP(B10,#REF!,3,FALSE))","v":{"$error":"#REF!"}},22,22,{"$f":"IF(C10=\"\",\"\",VLOOKUP(C10,#REF!,7,FALSE))","v":{"$error":"#REF!"}},{"$error":"#REF!"},{"$f":"IF(E10=\"\",\"\",VLOOKUP(E10,#REF!,7,FALSE))","v":{"$error":"#REF!"}},{"$error":"#REF!"},{"$f":"IF(G10=\"\",\"\",VLOOKUP(G10,#REF!,7,FALSE))","v":{"$error":"#REF!"}},{"$error":"#REF!"},{"$f":"IF(I10=\"\",\"\",VLOOKUP(I10,#REF!,7,FALSE))","v":{"$error":"#REF!"}},{"$error":"#REF!"},{"$f":"IF(K10=\"\",\"\",VLOOKUP(K10,#REF!,7,FALSE))","v":{"$error":"#REF!"}},{"$error":"#REF!"},{"$error":"#REF!"}]
[{"$f":"IF(ISNA(VLOOKUP(B11,#REF!,3,FALSE))=TRUE,\"\",VLOOKUP(B11,#REF!,3,FALSE))","v":{"$error":"#REF!"}},20,20,{"$f":"IF(C11=\"\",\"\",VLOOKUP(C11,#REF!,7,FALSE))","v":{"$error":"#REF!"}},{"$error":"#REF!"},{"$f":"IF(E11=\"\",\"\",VLOOKUP(E11,#REF!,7,FALSE))","v":{"$error":"#REF!"}},{"$error":"#REF!"},{"$f":"IF(G11=\"\",\"\",VLOOKUP(G11,#REF!,7,FALSE))","v":{"$error":"#REF!"}},{"$error":"#REF!"},{"$f":"IF(I11=\"\",\"\",VLOOKUP(I11,#REF!,7,FALSE))","v":{"$error":"#REF!"}},{"$error":"#REF!"},{"$f":"IF(K11=\"\",\"\",VLOOKUP(K11,#REF!,7,FALSE))","v":{"$error":"#REF!"}},{"$error":"#REF!"},{"$error":"#REF!"}]
[{"$f":"IF(ISNA(VLOOKUP(B12,#REF!,3,FALSE))=TRUE,\"\",VLOOKUP(B12,#REF!,3,FALSE))","v":{"$error":"#REF!"}},21,21,{"$f":"IF(C12=\"\",\"\",VLOOKUP(C12,#REF!,7,FALSE))","v":{"$error":"#REF!"}},{"$error":"#REF!"},{"$f":"IF(E12=\"\",\"\",VLOOKUP(E12,#REF!,7,FALSE))","v":{"$error":"#REF!"}},{"$error":"#REF!"},{"$f":"IF(G12=\"\",\"\",VLOOKUP(G12,#REF!,7,FALSE))","v":{"$error":"#REF!"}},{"$error":"#REF!"},{"$f":"IF(I12=\"\",\"\",VLOOKUP(I12,#REF!,7,FALSE))","v":{"$error":"#REF!"}},{"$error":"#REF!"},{"$f":"IF(K12=\"\",\"\",VLOOKUP(K12,#REF!,7,FALSE))","v":{"$error":"#REF!"}},{"$error":"#REF!"},{"$error":"#REF!"}]
[{"$f":"IF(ISNA(VLOOKUP(B13,#REF!,3,FALSE))=TRUE,\"\",VLOOKUP(B13,#REF!,3,FALSE))","v":{"$error":"#REF!"}},27,27,{"$f":"IF(C13=\"\",\"\",VLOOKUP(C13,#REF!,7,FALSE))","v":{"$error":"#REF!"}},{"$error":"#REF!"},{"$f":"IF(E13=\"\",\"\",VLOOKUP(E13,#REF!,7,FALSE))","v":{"$error":"#REF!"}},{"$error":"#REF!"},{"$f":"IF(G13=\"\",\"\",VLOOKUP(G13,#REF!,7,FALSE))","v":{"$error":"#REF!"}},{"$error":"#REF!"},{"$f":"IF(I13=\"\",\"\",VLOOKUP(I13,#REF!,7,FALSE))","v":{"$error":"#REF!"}},{"$error":"#REF!"},{"$f":"IF(K13=\"\",\"\",VLOOKUP(K13,#REF!,7,FALSE))","v":{"$error":"#REF!"}},{"$error":"#REF!"},{"$error":"#REF!"}]
[{"$f":"IF(ISNA(VLOOKUP(B14,#REF!,3,FALSE))=TRUE,\"\",VLOOKUP(B14,#REF!,3,FALSE))","v":{"$error":"#REF!"}},28,28,{"$f":"IF(C14=\"\",\"\",VLOOKUP(C14,#REF!,7,FALSE))","v":{"$error":"#REF!"}},{"$error":"#REF!"},{"$f":"IF(E14=\"\",\"\",VLOOKUP(E14,#REF!,7,FALSE))","v":{"$error":"#REF!"}},{"$error":"#REF!"},{"$f":"IF(G14=\"\",\"\",VLOOKUP(G14,#REF!,7,FALSE))","v":{"$error":"#REF!"}},{"$error":"#REF!"},{"$f":"IF(I14=\"\",\"\",VLOOKUP(I14,#REF!,7,FALSE))","v":{"$error":"#REF!"}},{"$error":"#REF!"},{"$f":"IF(K14=\"\",\"\",VLOOKUP(K14,#REF!,7,FALSE))","v":{"$error":"#REF!"}},{"$error":"#REF!"},{"$error":"#REF!"}]
[{"$f":"IF(ISNA(VLOOKUP(B15,#REF!,3,FALSE))=TRUE,\"\",VLOOKUP(B15,#REF!,3,FALSE))","v":{"$error":"#REF!"}},30,{"$f":"B15","v":30},{"$f":"IF(C15=\"\",\"\",VLOOKUP(C15,#REF!,7,FALSE))","v":{"$error":"#REF!"}},{"$error":"#REF!"},{"$f":"IF(E15=\"\",\"\",VLOOKUP(E15,#REF!,7,FALSE))","v":{"$error":"#REF!"}},{"$error":"#REF!"},{"$f":"IF(G15=\"\",\"\",VLOOKUP(G15,#REF!,7,FALSE))","v":{"$error":"#REF!"}},{"$error":"#REF!"},{"$f":"IF(I15=\"\",\"\",VLOOKUP(I15,#REF!,7,FALSE))","v":{"$error":"#REF!"}},{"$error":"#REF!"},{"$f":"IF(K15=\"\",\"\",VLOOKUP(K15,#REF!,7,FALSE))","v":{"$error":"#REF!"}},{"$error":"#REF!"},{"$f":"IF(M15=\"\",\"\",IF(M15=M14,N14,ROW()-3))","v":{"$error":"#REF!"}}]
[{"$f":"IF(ISNA(VLOOKUP(B16,#REF!,3,FALSE))=TRUE,\"\",VLOOKUP(B16,#REF!,3,FALSE))","v":{"$error":"#REF!"}},25,25,{"$f":"IF(C16=\"\",\"\",VLOOKUP(C16,#REF!,7,FALSE))","v":{"$error":"#REF!"}},{"$error":"#REF!"},{"$f":"IF(E16=\"\",\"\",VLOOKUP(E16,#REF!,7,FALSE))","v":{"$error":"#REF!"}},{"$error":"#REF!"},{"$f":"IF(G16=\"\",\"\",VLOOKUP(G16,#REF!,7,FALSE))","v":{"$error":"#REF!"}},{"$error":"#REF!"},{"$f":"IF(I16=\"\",\"\",VLOOKUP(I16,#REF!,7,FALSE))","v":{"$error":"#REF!"}},{"$error":"#REF!"},{"$f":"IF(K16=\"\",\"\",VLOOKUP(K16,#REF!,7,FALSE))","v":{"$error":"#REF!"}},{"$error":"#REF!"},{"$error":"#REF!"}]
[{"$f":"IF(ISNA(VLOOKUP(B17,#REF!,3,FALSE))=TRUE,\"\",VLOOKUP(B17,#REF!,3,FALSE))","v":{"$error":"#REF!"}},17,17,{"$f":"IF(C17=\"\",\"\",VLOOKUP(C17,#REF!,7,FALSE))","v":{"$error":"#REF!"}},{"$error":"#REF!"},{"$f":"IF(E17=\"\",\"\",VLOOKUP(E17,#REF!,7,FALSE))","v":{"$error":"#REF!"}},{"$error":"#REF!"},{"$f":"IF(G17=\"\",\"\",VLOOKUP(G17,#REF!,7,FALSE))","v":{"$error":"#REF!"}},{"$error":"#REF!"},{"$f":"IF(I17=\"\",\"\",VLOOKUP(I17,#REF!,7,FALSE))","v":{"$error":"#REF!"}},{"$error":"#REF!"},{"$f":"IF(K17=\"\",\"\",VLOOKUP(K17,#REF!,7,FALSE))","v":{"$error":"#REF!"}},{"$error":"#REF!"},{"$error":"#REF!"}]
[{"$f":"IF(ISNA(VLOOKUP(B18,#REF!,3,FALSE))=TRUE,\"\",VLOOKUP(B18,#REF!,3,FALSE))","v":{"$error":"#REF!"}},2,2,{"$f":"IF(C18=\"\",\"\",VLOOKUP(C18,#REF!,7,FALSE))","v":{"$error":"#REF!"}},{"$error":"#REF!"},{"$f":"IF(E18=\"\",\"\",VLOOKUP(E18,#REF!,7,FALSE))","v":{"$error":"#REF!"}},{"$error":"#REF!"},{"$f":"IF(G18=\"\",\"\",VLOOKUP(G18,#REF!,7,FALSE))","v":{"$error":"#REF!"}},{"$error":"#REF!"},{"$f":"IF(I18=\"\",\"\",VLOOKUP(I18,#REF!,7,FALSE))","v":{"$error":"#REF!"}},{"$error":"#REF!"},{"$f":"IF(K18=\"\",\"\",VLOOKUP(K18,#REF!,7,FALSE))","v":{"$error":"#REF!"}},{"$error":"#REF!"},{"$error":"#REF!"}]
[{"$f":"IF(ISNA(VLOOKUP(B19,#REF!,3,FALSE))=TRUE,\"\",VLOOKUP(B19,#REF!,3,FALSE))","v":{"$error":"#REF!"}},6,6,{"$f":"IF(C19=\"\",\"\",VLOOKUP(C19,#REF!,7,FALSE))","v":{"$error":"#REF!"}},{"$error":"#REF!"},{"$f":"IF(E19=\"\",\"\",VLOOKUP(E19,#REF!,7,FALSE))","v":{"$error":"#REF!"}},{"$error":"#REF!"},{"$f":"IF(G19=\"\",\"\",VLOOKUP(G19,#REF!,7,FALSE))","v":{"$error":"#REF!"}},{"$error":"#REF!"},{"$f":"IF(I19=\"\",\"\",VLOOKUP(I19,#REF!,7,FALSE))","v":{"$error":"#REF!"}},{"$error":"#REF!"},{"$f":"IF(K19=\"\",\"\",VLOOKUP(K19,#REF!,7,FALSE))","v":{"$error":"#REF!"}},{"$error":"#REF!"},{"$error":"#REF!"}]
[{"$f":"IF(ISNA(VLOOKUP(B20,#REF!,3,FALSE))=TRUE,\"\",VLOOKUP(B20,#REF!,3,FALSE))","v":{"$error":"#REF!"}},1,{"$f":"B20","v":1},{"$f":"IF(C20=\"\",\"\",VLOOKUP(C20,#REF!,7,FALSE))","v":{"$error":"#REF!"}},{"$f":"IF(C20=\"\",\"\",IF((C20+NpZ+ZP)>2*NpZ,(((C20+NpZ+ZP)-2*NpZ)+NpZ),(C20+NpZ+ZP)))","v":{"$error":"#REF!"}},{"$f":"IF(E20=\"\",\"\",VLOOKUP(E20,#REF!,7,FALSE))","v":{"$error":"#REF!"}},{"$f":"IF(E20=\"\",\"\",IF((E20+NpZ+ZP)>3*NpZ,(((E20+NpZ+ZP)-2*NpZ)+NpZ),(E20+NpZ+ZP)))","v":{"$error":"#REF!"}},{"$f":"IF(G20=\"\",\"\",VLOOKUP(G20,#REF!,7,FALSE))","v":{"$error":"#REF!"}},{"$f":"IF(G20=\"\",\"\",IF((G20+NpZ+ZP)>4*NpZ,(((G20+NpZ+ZP)-2*NpZ)+NpZ),(G20+NpZ+ZP)))","v":{"$error":"#REF!"}},{"$f":"IF(I20=\"\",\"\",VLOOKUP(I20,#REF!,7,FALSE))","v":{"$error":"#REF!"}},{"$f":"IF(I20=\"\",\"\",IF((I20+NpZ+ZP)>5*NpZ,(((I20+NpZ+ZP)-2*NpZ)+NpZ),(I20+NpZ+ZP)))","v":{"$error":"#REF!"}},{"$f":"IF(K20=\"\",\"\",VLOOKUP(K20,#REF!,7,FALSE))","v":{"$error":"#REF!"}},{"$f":"IF(B20=\"\",\"\",(D20+F20+H20+J20+L20))","v":{"$error":"#REF!"}},{"$f":"IF(M20=\"\",\"\",IF(M20=M19,N19,ROW()-3))","v":{"$error":"#REF!"}}]
[{"$f":"IF(ISNA(VLOOKUP(B21,#REF!,3,FALSE))=TRUE,\"\",VLOOKUP(B21,#REF!,3,FALSE))","v":{"$error":"#REF!"}},29,{"$f":"B21","v":29},{"$f":"IF(C21=\"\",\"\",VLOOKUP(C21,#REF!,7,FALSE))","v":{"$error":"#REF!"}},{"$error":"#REF!"},{"$f":"IF(E21=\"\",\"\",VLOOKUP(E21,#REF!,7,FALSE))","v":{"$error":"#REF!"}},{"$error":"#REF!"},{"$f":"IF(G21=\"\",\"\",VLOOKUP(G21,#REF!,7,FALSE))","v":{"$error":"#REF!"}},{"$error":"#REF!"},{"$f":"IF(I21=\"\",\"\",VLOOKUP(I21,#REF!,7,FALSE))","v":{"$error":"#REF!"}},{"$error":"#REF!"},{"$f":"IF(K21=\"\",\"\",VLOOKUP(K21,#REF!,7,FALSE))","v":{"$error":"#REF!"}},{"$error":"#REF!"},{"$f":"IF(M21=\"\",\"\",IF(M21=M20,N20,ROW()-3))","v":{"$error":"#REF!"}}]
[{"$f":"IF(ISNA(VLOOKUP(B22,#REF!,3,FALSE))=TRUE,\"\",VLOOKUP(B22,#REF!,3,FALSE))","v":{"$error":"#REF!"}},23,23,{"$f":"IF(C22=\"\",\"\",VLOOKUP(C22,#REF!,7,FALSE))","v":{"$error":"#REF!"}},{"$error":"#REF!"},{"$f":"IF(E22=\"\",\"\",VLOOKUP(E22,#REF!,7,FALSE))","v":{"$error":"#REF!"}},{"$error":"#REF!"},{"$f":"IF(G22=\"\",\"\",VLOOKUP(G22,#REF!,7,FALSE))","v":{"$error":"#REF!"}},{"$error":"#REF!"},{"$f":"IF(I22=\"\",\"\",VLOOKUP(I22,#REF!,7,FALSE))","v":{"$error":"#REF!"}},{"$error":"#REF!"},{"$f":"IF(K22=\"\",\"\",VLOOKUP(K22,#REF!,7,FALSE))","v":{"$error":"#REF!"}},{"$error":"#REF!"},{"$error":"#REF!"}]
[{"$f":"IF(ISNA(VLOOKUP(B23,#REF!,3,FALSE))=TRUE,\"\",VLOOKUP(B23,#REF!,3,FALSE))","v":{"$error":"#REF!"}},16,16,{"$f":"IF(C23=\"\",\"\",VLOOKUP(C23,#REF!,7,FALSE))","v":{"$error":"#REF!"}},{"$error":"#REF!"},{"$f":"IF(E23=\"\",\"\",VLOOKUP(E23,#REF!,7,FALSE))","v":{"$error":"#REF!"}},{"$error":"#REF!"},{"$f":"IF(G23=\"\",\"\",VLOOKUP(G23,#REF!,7,FALSE))","v":{"$error":"#REF!"}},{"$error":"#REF!"},{"$f":"IF(I23=\"\",\"\",VLOOKUP(I23,#REF!,7,FALSE))","v":{"$error":"#REF!"}},{"$error":"#REF!"},{"$f":"IF(K23=\"\",\"\",VLOOKUP(K23,#REF!,7,FALSE))","v":{"$error":"#REF!"}},{"$error":"#REF!"},{"$error":"#REF!"}]
[{"$f":"IF(ISNA(VLOOKUP(B24,#REF!,3,FALSE))=TRUE,\"\",VLOOKUP(B24,#REF!,3,FALSE))","v":{"$error":"#REF!"}},14,14,{"$f":"IF(C24=\"\",\"\",VLOOKUP(C24,#REF!,7,FALSE))","v":{"$error":"#REF!"}},{"$error":"#REF!"},{"$f":"IF(E24=\"\",\"\",VLOOKUP(E24,#REF!,7,FALSE))","v":{"$error":"#REF!"}},{"$error":"#REF!"},{"$f":"IF(G24=\"\",\"\",VLOOKUP(G24,#REF!,7,FALSE))","v":{"$error":"#REF!"}},{"$error":"#REF!"},{"$f":"IF(I24=\"\",\"\",VLOOKUP(I24,#REF!,7,FALSE))","v":{"$error":"#REF!"}},{"$error":"#REF!"},{"$f":"IF(K24=\"\",\"\",VLOOKUP(K24,#REF!,7,FALSE))","v":{"$error":"#REF!"}},{"$error":"#REF!"},{"$error":"#REF!"}]
[{"$f":"IF(ISNA(VLOOKUP(B25,#REF!,3,FALSE))=TRUE,\"\",VLOOKUP(B25,#REF!,3,FALSE))","v":{"$error":"#REF!"}},24,24,{"$f":"IF(C25=\"\",\"\",VLOOKUP(C25,#REF!,7,FALSE))","v":{"$error":"#REF!"}},{"$error":"#REF!"},{"$f":"IF(E25=\"\",\"\",VLOOKUP(E25,#REF!,7,FALSE))","v":{"$error":"#REF!"}},{"$error":"#REF!"},{"$f":"IF(G25=\"\",\"\",VLOOKUP(G25,#REF!,7,FALSE))","v":{"$error":"#REF!"}},{"$error":"#REF!"},{"$f":"IF(I25=\"\",\"\",VLOOKUP(I25,#REF!,7,FALSE))","v":{"$error":"#REF!"}},{"$error":"#REF!"},{"$f":"IF(K25=\"\",\"\",VLOOKUP(K25,#REF!,7,FALSE))","v":{"$error":"#REF!"}},{"$error":"#REF!"},{"$error":"#REF!"}]
[{"$f":"IF(ISNA(VLOOKUP(B26,#REF!,3,FALSE))=TRUE,\"\",VLOOKUP(B26,#REF!,3,FALSE))","v":{"$error":"#REF!"}},15,15,{"$f":"IF(C26=\"\",\"\",VLOOKUP(C26,#REF!,7,FALSE))","v":{"$error":"#REF!"}},{"$error":"#REF!"},{"$f":"IF(E26=\"\",\"\",VLOOKUP(E26,#REF!,7,FALSE))","v":{"$error":"#REF!"}},{"$error":"#REF!"},{"$f":"IF(G26=\"\",\"\",VLOOKUP(G26,#REF!,7,FALSE))","v":{"$error":"#REF!"}},{"$error":"#REF!"},{"$f":"IF(I26=\"\",\"\",VLOOKUP(I26,#REF!,7,FALSE))","v":{"$error":"#REF!"}},{"$error":"#REF!"},{"$f":"IF(K26=\"\",\"\",VLOOKUP(K26,#REF!,7,FALSE))","v":{"$error":"#REF!"}},{"$error":"#REF!"},{"$error":"#REF!"}]
[{"$f":"IF(ISNA(VLOOKUP(B27,#REF!,3,FALSE))=TRUE,\"\",VLOOKUP(B27,#REF!,3,FALSE))","v":{"$error":"#REF!"}},19,19,{"$f":"IF(C27=\"\",\"\",VLOOKUP(C27,#REF!,7,FALSE))","v":{"$error":"#REF!"}},{"$error":"#REF!"},{"$f":"IF(E27=\"\",\"\",VLOOKUP(E27,#REF!,7,FALSE))","v":{"$error":"#REF!"}},{"$error":"#REF!"},{"$f":"IF(G27=\"\",\"\",VLOOKUP(G27,#REF!,7,FALSE))","v":{"$error":"#REF!"}},{"$error":"#REF!"},{"$f":"IF(I27=\"\",\"\",VLOOKUP(I27,#REF!,7,FALSE))","v":{"$error":"#REF!"}},{"$error":"#REF!"},{"$f":"IF(K27=\"\",\"\",VLOOKUP(K27,#REF!,7,FALSE))","v":{"$error":"#REF!"}},{"$error":"#REF!"},{"$error":"#REF!"}]
[{"$f":"IF(ISNA(VLOOKUP(B28,#REF!,3,FALSE))=TRUE,\"\",VLOOKUP(B28,#REF!,3,FALSE))","v":{"$error":"#REF!"}},18,18,{"$f":"IF(C28=\"\",\"\",VLOOKUP(C28,#REF!,7,FALSE))","v":{"$error":"#REF!"}},{"$error":"#REF!"},{"$f":"IF(E28=\"\",\"\",VLOOKUP(E28,#REF!,7,FALSE))","v":{"$error":"#REF!"}},{"$error":"#REF!"},{"$f":"IF(G28=\"\",\"\",VLOOKUP(G28,#REF!,7,FALSE))","v":{"$error":"#REF!"}},{"$error":"#REF!"},{"$f":"IF(I28=\"\",\"\",VLOOKUP(I28,#REF!,7,FALSE))","v":{"$error":"#REF!"}},{"$error":"#REF!"},{"$f":"IF(K28=\"\",\"\",VLOOKUP(K28,#REF!,7,FALSE))","v":{"$error":"#REF!"}},{"$error":"#REF!"},{"$error":"#REF!"}]
[{"$f":"IF(ISNA(VLOOKUP(B29,#REF!,3,FALSE))=TRUE,\"\",VLOOKUP(B29,#REF!,3,FALSE))","v":{"$error":"#REF!"}},7,7,{"$f":"IF(C29=\"\",\"\",VLOOKUP(C29,#REF!,7,FALSE))","v":{"$error":"#REF!"}},{"$error":"#REF!"},{"$f":"IF(E29=\"\",\"\",VLOOKUP(E29,#REF!,7,FALSE))","v":{"$error":"#REF!"}},{"$error":"#REF!"},{"$f":"IF(G29=\"\",\"\",VLOOKUP(G29,#REF!,7,FALSE))","v":{"$error":"#REF!"}},{"$error":"#REF!"},{"$f":"IF(I29=\"\",\"\",VLOOKUP(I29,#REF!,7,FALSE))","v":{"$error":"#REF!"}},{"$error":"#REF!"},{"$f":"IF(K29=\"\",\"\",VLOOKUP(K29,#REF!,7,FALSE))","v":{"$error":"#REF!"}},{"$error":"#REF!"},{"$error":"#REF!"}]
[{"$f":"IF(ISNA(VLOOKUP(B30,#REF!,3,FALSE))=TRUE,\"\",VLOOKUP(B30,#REF!,3,FALSE))","v":{"$error":"#REF!"}},3,3,{"$f":"IF(C30=\"\",\"\",VLOOKUP(C30,#REF!,7,FALSE))","v":{"$error":"#REF!"}},{"$error":"#REF!"},{"$f":"IF(E30=\"\",\"\",VLOOKUP(E30,#REF!,7,FALSE))","v":{"$error":"#REF!"}},{"$error":"#REF!"},{"$f":"IF(G30=\"\",\"\",VLOOKUP(G30,#REF!,7,FALSE))","v":{"$error":"#REF!"}},{"$error":"#REF!"},{"$f":"IF(I30=\"\",\"\",VLOOKUP(I30,#REF!,7,FALSE))","v":{"$error":"#REF!"}},{"$error":"#REF!"},{"$f":"IF(K30=\"\",\"\",VLOOKUP(K30,#REF!,7,FALSE))","v":{"$error":"#REF!"}},{"$error":"#REF!"},{"$error":"#REF!"}]
[{"$f":"IF(ISNA(VLOOKUP(B31,#REF!,3,FALSE))=TRUE,\"\",VLOOKUP(B31,#REF!,3,FALSE))","v":{"$error":"#REF!"}},5,5,{"$f":"IF(C31=\"\",\"\",VLOOKUP(C31,#REF!,7,FALSE))","v":{"$error":"#REF!"}},{"$error":"#REF!"},{"$f":"IF(E31=\"\",\"\",VLOOKUP(E31,#REF!,7,FALSE))","v":{"$error":"#REF!"}},{"$error":"#REF!"},{"$f":"IF(G31=\"\",\"\",VLOOKUP(G31,#REF!,7,FALSE))","v":{"$error":"#REF!"}},{"$error":"#REF!"},{"$f":"IF(I31=\"\",\"\",VLOOKUP(I31,#REF!,7,FALSE))","v":{"$error":"#REF!"}},{"$error":"#REF!"},{"$f":"IF(K31=\"\",\"\",VLOOKUP(K31,#REF!,7,FALSE))","v":{"$error":"#REF!"}},{"$error":"#REF!"},{"$error":"#REF!"}]
[{"$f":"IF(ISNA(VLOOKUP(B32,#REF!,2,FALSE))=TRUE,\"\",VLOOKUP(B32,#REF!,2,FALSE))","v":{"$error":"#REF!"}},8,8,{"$f":"IF(C32=\"\",\"\",VLOOKUP(C32,#REF!,7,FALSE))","v":{"$error":"#REF!"}},{"$error":"#REF!"},{"$f":"IF(E32=\"\",\"\",VLOOKUP(E32,#REF!,7,FALSE))","v":{"$error":"#REF!"}},{"$error":"#REF!"},{"$f":"IF(G32=\"\",\"\",VLOOKUP(G32,#REF!,7,FALSE))","v":{"$error":"#REF!"}},{"$error":"#REF!"},{"$f":"IF(I32=\"\",\"\",VLOOKUP(I32,#REF!,7,FALSE))","v":{"$error":"#REF!"}},{"$error":"#REF!"},{"$f":"IF(K32=\"\",\"\",VLOOKUP(K32,#REF!,7,FALSE))","v":{"$error":"#REF!"}},{"$error":"#REF!"},{"$error":"#REF!"}]
[{"$f":"IF(ISNA(VLOOKUP(B33,#REF!,2,FALSE))=TRUE,\"\",VLOOKUP(B33,#REF!,2,FALSE))","v":{"$error":"#REF!"}},13,13,{"$f":"IF(C33=\"\",\"\",VLOOKUP(C33,#REF!,7,FALSE))","v":{"$error":"#REF!"}},{"$error":"#REF!"},{"$f":"IF(E33=\"\",\"\",VLOOKUP(E33,#REF!,7,FALSE))","v":{"$error":"#REF!"}},{"$error":"#REF!"},{"$f":"IF(G33=\"\",\"\",VLOOKUP(G33,#REF!,7,FALSE))","v":{"$error":"#REF!"}},{"$error":"#REF!"},{"$f":"IF(I33=\"\",\"\",VLOOKUP(I33,#REF!,7,FALSE))","v":{"$error":"#REF!"}},{"$error":"#REF!"},{"$f":"IF(K33=\"\",\"\",VLOOKUP(K33,#REF!,7,FALSE))","v":{"$error":"#REF!"}},{"$error":"#REF!"},{"$error":"#REF!"}]
["Day 1 Zone Winner",null,"IAN LAMBERT",null,"IVOR SMITH",null,"WAYNE PERRING",null,"JOE ARCH",null,"KEN SHOVE"]
["Day 1 Zone Second",null,"ALAN PRICE",null,"SIMON DRAYTON",null,"ROB TUCK",null,"JOHN VAN CRUGTEN",null,"LEE CULLEN"]
["Day 1 Zone Third",null,"NEIL CUTLER",null,"MIKE KEMPSTER",null,"TONY THOMAS",null,"JIM GROSS",null,"TONY ANDERSON"]
["Day 1 Zone Third",null,null,null,null,null,null,null,null,null,"C. READ"]
["SAMF 2006 National Sea League Final  -  Day 2"]
["Team Name","Team No. ","Zone A",null,"Zone B",null,"Zone C",null,"Zone D",null,"Zone E",null,"Day 2 Points","Day 2 Position"]
[null,null,"Peg","Points & Position","Peg","Points & Position","Peg","Points & Position","Peg","Points & Position","Peg","Points & Position"]
[{"$f":"IF(ISNA(VLOOKUP(B41,#REF!,3,FALSE))=TRUE,\"\",VLOOKUP(B41,#REF!,3,FALSE))","v":{"$error":"#REF!"}},11,{"$f":"VLOOKUP(B41,#REF!,6,FALSE)","v":{"$error":"#REF!"}},{"$f":"IF(C41=\"\",\"\",VLOOKUP(C41,#REF!,7,FALSE))","v":{"$error":"#REF!"}},{"$f":"IF(C41=\"\",\"\",IF((C41+NpZ+ZP)>2*NpZ,(((C41+NpZ+ZP)-2*NpZ)+NpZ),(C41+NpZ+ZP)))","v":{"$error":"#REF!"}},{"$f":"IF(E41=\"\",\"\",VLOOKUP(E41,#REF!,7,FALSE))","v":{"$error":"#REF!"}},{"$f":"IF(E41=\"\",\"\",IF((E41+NpZ+ZP)>3*NpZ,(((E41+NpZ+ZP)-2*NpZ)+NpZ),(E41+NpZ+ZP)))","v":{"$error":"#REF!"}},{"$f":"IF(G41=\"\",\"\",VLOOKUP(G41,#REF!,7,FALSE))","v":{"$error":"#REF!"}},{"$f":"IF(G41=\"\",\"\",IF((G41+NpZ+ZP)>4*NpZ,(((G41+NpZ+ZP)-2*NpZ)+NpZ),(G41+NpZ+ZP)))","v":{"$error":"#REF!"}},{"$f":"IF(I41=\"\",\"\",VLOOKUP(I41,#REF!,7,FALSE))","v":{"$error":"#REF!"}},{"$f":"IF(I41=\"\",\"\",IF((I41+NpZ+ZP)>5*NpZ,(((I41+NpZ+ZP)-2*NpZ)+NpZ),(I41+NpZ+ZP)))","v":{"$error":"#REF!"}},{"$f":"IF(K41=\"\",\"\",VLOOKUP(K41,#REF!,7,FALSE))","v":{"$error":"#REF!"}},{"$f":"IF(B41=\"\",\"\",(D41+F41+H41+J41+L41))","v":{"$error":"#REF!"}},{"$f":"IF(M41=\"\",\"\",IF(M41=M40,N40,ROW()-40))","v":{"$error":"#REF!"}}]
[{"$f":"IF(ISNA(VLOOKUP(B42,#REF!,3,FALSE))=TRUE,\"\",VLOOKUP(B42,#REF!,3,FALSE))","v":{"$error":"#REF!"}},30,{"$f":"VLOOKUP(B42,#REF!,6,FALSE)","v":{"$error":"#REF!"}},{"$f":"IF(C42=\"\",\"\",VLOOKUP(C42,#REF!,7,FALSE))","v":{"$error":"#REF!"}},{"$f":"IF(C42=\"\",\"\",IF((C42+NpZ+ZP)>2*NpZ,(((C42+NpZ+ZP)-2*NpZ)+NpZ),(C42+NpZ+ZP)))","v":{"$error":"#REF!"}},{"$f":"IF(E42=\"\",\"\",VLOOKUP(E42,#REF!,7,FALSE))","v":{"$error":"#REF!"}},{"$f":"IF(E42=\"\",\"\",IF((E42+NpZ+ZP)>3*NpZ,(((E42+NpZ+ZP)-2*NpZ)+NpZ),(E42+NpZ+ZP)))","v":{"$error":"#REF!"}},{"$f":"IF(G42=\"\",\"\",VLOOKUP(G42,#REF!,7,FALSE))","v":{"$error":"#REF!"}},{"$f":"IF(G42=\"\",\"\",IF((G42+NpZ+ZP)>4*NpZ,(((G42+NpZ+ZP)-2*NpZ)+NpZ),(G42+NpZ+ZP)))","v":{"$error":"#REF!"}},{"$f":"IF(I42=\"\",\"\",VLOOKUP(I42,#REF!,7,FALSE))","v":{"$error":"#REF!"}},{"$f":"IF(I42=\"\",\"\",IF((I42+NpZ+ZP)>5*NpZ,(((I42+NpZ+ZP)-2*NpZ)+NpZ),(I42+NpZ+ZP)))","v":{"$error":"#REF!"}},{"$f":"IF(K42=\"\",\"\",VLOOKUP(K42,#REF!,7,FALSE))","v":{"$error":"#REF!"}},{"$error":"#REF!"},{"$f":"IF(M42=\"\",\"\",IF(M42=M41,N41,ROW()-40))","v":{"$error":"#REF!"}}]
[{"$f":"IF(ISNA(VLOOKUP(B43,#REF!,3,FALSE))=TRUE,\"\",VLOOKUP(B43,#REF!,3,FALSE))","v":{"$error":"#REF!"}},12,{"$f":"VLOOKUP(B43,#REF!,6,FALSE)","v":{"$error":"#REF!"}},{"$f":"IF(C43=\"\",\"\",VLOOKUP(C43,#REF!,7,FALSE))","v":{"$error":"#REF!"}},{"$error":"#REF!"},{"$f":"IF(E43=\"\",\"\",VLOOKUP(E43,#REF!,7,FALSE))","v":{"$error":"#REF!"}},{"$error":"#REF!"},{"$f":"IF(G43=\"\",\"\",VLOOKUP(G43,#REF!,7,FALSE))","v":{"$error":"#REF!"}},{"$error":"#REF!"},{"$f":"IF(I43=\"\",\"\",VLOOKUP(I43,#REF!,7,FALSE))","v":{"$error":"#REF!"}},{"$error":"#REF!"},{"$f":"IF(K43=\"\",\"\",VLOOKUP(K43,#REF!,7,FALSE))","v":{"$error":"#REF!"}},{"$error":"#REF!"},{"$error":"#REF!"}]
[{"$f":"IF(ISNA(VLOOKUP(B44,#REF!,3,FALSE))=TRUE,\"\",VLOOKUP(B44,#REF!,3,FALSE))","v":{"$error":"#REF!"}},9,{"$f":"VLOOKUP(B44,#REF!,6,FALSE)","v":{"$error":"#REF!"}},{"$f":"IF(C44=\"\",\"\",VLOOKUP(C44,#REF!,7,FALSE))","v":{"$error":"#REF!"}},{"$error":"#REF!"},{"$f":"IF(E44=\"\",\"\",VLOOKUP(E44,#REF!,7,FALSE))","v":{"$error":"#REF!"}},{"$error":"#REF!"},{"$f":"IF(G44=\"\",\"\",VLOOKUP(G44,#REF!,7,FALSE))","v":{"$error":"#REF!"}},{"$error":"#REF!"},{"$f":"IF(I44=\"\",\"\",VLOOKUP(I44,#REF!,7,FALSE))","v":{"$error":"#REF!"}},{"$error":"#REF!"},{"$f":"IF(K44=\"\",\"\",VLOOKUP(K44,#REF!,7,FALSE))","v":{"$error":"#REF!"}},{"$error":"#REF!"},{"$f":"IF(M44=\"\",\"\",IF(M44=M43,N43,ROW()-40))","v":{"$error":"#REF!"}}]
[{"$f":"IF(ISNA(VLOOKUP(B45,#REF!,3,FALSE))=TRUE,\"\",VLOOKUP(B45,#REF!,3,FALSE))","v":{"$error":"#REF!"}},20,{"$f":"VLOOKUP(B45,#REF!,6,FALSE)","v":{"$error":"#REF!"}},{"$f":"IF(C45=\"\",\"\",VLOOKUP(C45,#REF!,7,FALSE))","v":{"$error":"#REF!"}},{"$error":"#REF!"},{"$f":"IF(E45=\"\",\"\",VLOOKUP(E45,#REF!,7,FALSE))","v":{"$error":"#REF!"}},{"$error":"#REF!"},{"$f":"IF(G45=\"\",\"\",VLOOKUP(G45,#REF!,7,FALSE))","v":{"$error":"#REF!"}},{"$error":"#REF!"},{"$f":"IF(I45=\"\",\"\",VLOOKUP(I45,#REF!,7,FALSE))","v":{"$error":"#REF!"}},{"$error":"#REF!"},{"$f":"IF(K45=\"\",\"\",VLOOKUP(K45,#REF!,7,FALSE))","v":{"$error":"#REF!"}},{"$error":"#REF!"},{"$error":"#REF!"}]
[{"$f":"IF(ISNA(VLOOKUP(B46,#REF!,3,FALSE))=TRUE,\"\",VLOOKUP(B46,#REF!,3,FALSE))","v":{"$error":"#REF!"}},10,{"$f":"VLOOKUP(B46,#REF!,6,FALSE)","v":{"$error":"#REF!"}},{"$f":"IF(C46=\"\",\"\",VLOOKUP(C46,#REF!,7,FALSE))","v":{"$error":"#REF!"}},{"$error":"#REF!"},{"$f":"IF(E46=\"\",\"\",VLOOKUP(E46,#REF!,7,FALSE))","v":{"$error":"#REF!"}},{"$error":"#REF!"},{"$f":"IF(G46=\"\",\"\",VLOOKUP(G46,#REF!,7,FALSE))","v":{"$error":"#REF!"}},{"$error":"#REF!"},{"$f":"IF(I46=\"\",\"\",VLOOKUP(I46,#REF!,7,FALSE))","v":{"$error":"#REF!"}},{"$error":"#REF!"},{"$f":"IF(K46=\"\",\"\",VLOOKUP(K46,#REF!,7,FALSE))","v":{"$error":"#REF!"}},{"$error":"#REF!"},{"$error":"#REF!"}]
[{"$f":"IF(ISNA(VLOOKUP(B47,#REF!,3,FALSE))=TRUE,\"\",VLOOKUP(B47,#REF!,3,FALSE))","v":{"$error":"#REF!"}},2,{"$f":"VLOOKUP(B47,#REF!,6,FALSE)","v":{"$error":"#REF!"}},{"$f":"IF(C47=\"\",\"\",VLOOKUP(C47,#REF!,7,FALSE))","v":{"$error":"#REF!"}},{"$error":"#REF!"},{"$f":"IF(E47=\"\",\"\",VLOOKUP(E47,#REF!,7,FALSE))","v":{"$error":"#REF!"}},{"$error":"#REF!"},{"$f":"IF(G47=\"\",\"\",VLOOKUP(G47,#REF!,7,FALSE))","v":{"$error":"#REF!"}},{"$error":"#REF!"},{"$f":"IF(I47=\"\",\"\",VLOOKUP(I47,#REF!,7,FALSE))","v":{"$error":"#REF!"}},{"$error":"#REF!"},{"$f":"IF(K47=\"\",\"\",VLOOKUP(K47,#REF!,7,FALSE))","v":{"$error":"#REF!"}},{"$error":"#REF!"},{"$error":"#REF!"}]
[{"$f":"IF(ISNA(VLOOKUP(B48,#REF!,3,FALSE))=TRUE,\"\",VLOOKUP(B48,#REF!,3,FALSE))","v":{"$error":"#REF!"}},27,{"$f":"VLOOKUP(B48,#REF!,6,FALSE)","v":{"$error":"#REF!"}},{"$f":"IF(C48=\"\",\"\",VLOOKUP(C48,#REF!,7,FALSE))","v":{"$error":"#REF!"}},{"$error":"#REF!"},{"$f":"IF(E48=\"\",\"\",VLOOKUP(E48,#REF!,7,FALSE))","v":{"$error":"#REF!"}},{"$error":"#REF!"},{"$f":"IF(G48=\"\",\"\",VLOOKUP(G48,#REF!,7,FALSE))","v":{"$error":"#REF!"}},{"$error":"#REF!"},{"$f":"IF(I48=\"\",\"\",VLOOKUP(I48,#REF!,7,FALSE))","v":{"$error":"#REF!"}},{"$error":"#REF!"},{"$f":"IF(K48=\"\",\"\",VLOOKUP(K48,#REF!,7,FALSE))","v":{"$error":"#REF!"}},{"$error":"#REF!"},{"$error":"#REF!"}]
[{"$f":"IF(ISNA(VLOOKUP(B49,#REF!,3,FALSE))=TRUE,\"\",VLOOKUP(B49,#REF!,3,FALSE))","v":{"$error":"#REF!"}},22,{"$f":"VLOOKUP(B49,#REF!,6,FALSE)","v":{"$error":"#REF!"}},{"$f":"IF(C49=\"\",\"\",VLOOKUP(C49,#REF!,7,FALSE))","v":{"$error":"#REF!"}},{"$error":"#REF!"},{"$f":"IF(E49=\"\",\"\",VLOOKUP(E49,#REF!,7,FALSE))","v":{"$error":"#REF!"}},{"$error":"#REF!"},{"$f":"IF(G49=\"\",\"\",VLOOKUP(G49,#REF!,7,FALSE))","v":{"$error":"#REF!"}},{"$error":"#REF!"},{"$f":"IF(I49=\"\",\"\",VLOOKUP(I49,#REF!,7,FALSE))","v":{"$error":"#REF!"}},{"$error":"#REF!"},{"$f":"IF(K49=\"\",\"\",VLOOKUP(K49,#REF!,7,FALSE))","v":{"$error":"#REF!"}},{"$error":"#REF!"},{"$error":"#REF!"}]
[{"$f":"IF(ISNA(VLOOKUP(B50,#REF!,3,FALSE))=TRUE,\"\",VLOOKUP(B50,#REF!,3,FALSE))","v":{"$error":"#REF!"}},15,{"$f":"VLOOKUP(B50,#REF!,6,FALSE)","v":{"$error":"#REF!"}},{"$f":"IF(C50=\"\",\"\",VLOOKUP(C50,#REF!,7,FALSE))","v":{"$error":"#REF!"}},{"$error":"#REF!"},{"$f":"IF(E50=\"\",\"\",VLOOKUP(E50,#REF!,7,FALSE))","v":{"$error":"#REF!"}},{"$error":"#REF!"},{"$f":"IF(G50=\"\",\"\",VLOOKUP(G50,#REF!,7,FALSE))","v":{"$error":"#REF!"}},{"$error":"#REF!"},{"$f":"IF(I50=\"\",\"\",VLOOKUP(I50,#REF!,7,FALSE))","v":{"$error":"#REF!"}},{"$error":"#REF!"},{"$f":"IF(K50=\"\",\"\",VLOOKUP(K50,#REF!,7,FALSE))","v":{"$error":"#REF!"}},{"$error":"#REF!"},{"$error":"#REF!"}]
[{"$f":"IF(ISNA(VLOOKUP(B51,#REF!,3,FALSE))=TRUE,\"\",VLOOKUP(B51,#REF!,3,FALSE))","v":{"$error":"#REF!"}},24,{"$f":"VLOOKUP(B51,#REF!,6,FALSE)","v":{"$error":"#REF!"}},{"$f":"IF(C51=\"\",\"\",VLOOKUP(C51,#REF!,7,FALSE))","v":{"$error":"#REF!"}},{"$error":"#REF!"},{"$f":"IF(E51=\"\",\"\",VLOOKUP(E51,#REF!,7,FALSE))","v":{"$error":"#REF!"}},{"$error":"#REF!"},{"$f":"IF(G51=\"\",\"\",VLOOKUP(G51,#REF!,7,FALSE))","v":{"$error":"#REF!"}},{"$error":"#REF!"},{"$f":"IF(I51=\"\",\"\",VLOOKUP(I51,#REF!,7,FALSE))","v":{"$error":"#REF!"}},{"$error":"#REF!"},{"$f":"IF(K51=\"\",\"\",VLOOKUP(K51,#REF!,7,FALSE))","v":{"$error":"#REF!"}},{"$error":"#REF!"},{"$error":"#REF!"}]
[{"$f":"IF(ISNA(VLOOKUP(B52,#REF!,3,FALSE))=TRUE,\"\",VLOOKUP(B52,#REF!,3,FALSE))","v":{"$error":"#REF!"}},1,{"$f":"VLOOKUP(B52,#REF!,6,FALSE)","v":{"$error":"#REF!"}},{"$f":"IF(C52=\"\",\"\",VLOOKUP(C52,#REF!,7,FALSE))","v":{"$error":"#REF!"}},{"$error":"#REF!"},{"$f":"IF(E52=\"\",\"\",VLOOKUP(E52,#REF!,7,FALSE))","v":{"$error":"#REF!"}},{"$error":"#REF!"},{"$f":"IF(G52=\"\",\"\",VLOOKUP(G52,#REF!,7,FALSE))","v":{"$error":"#REF!"}},{"$error":"#REF!"},{"$f":"IF(I52=\"\",\"\",VLOOKUP(I52,#REF!,7,FALSE))","v":{"$error":"#REF!"}},{"$error":"#REF!"},{"$f":"IF(K52=\"\",\"\",VLOOKUP(K52,#REF!,7,FALSE))","v":{"$error":"#REF!"}},{"$error":"#REF!"},{"$error":"#REF!"}]
[{"$f":"IF(ISNA(VLOOKUP(B53,#REF!,3,FALSE))=TRUE,\"\",VLOOKUP(B53,#REF!,3,FALSE))","v":{"$error":"#REF!"}},29,{"$f":"VLOOKUP(B53,#REF!,6,FALSE)","v":{"$error":"#REF!"}},{"$f":"IF(C53=\"\",\"\",VLOOKUP(C53,#REF!,7,FALSE))","v":{"$error":"#REF!"}},{"$error":"#REF!"},{"$f":"IF(E53=\"\",\"\",VLOOKUP(E53,#REF!,7,FALSE))","v":{"$error":"#REF!"}},{"$error":"#REF!"},{"$f":"IF(G53=\"\",\"\",VLOOKUP(G53,#REF!,7,FALSE))","v":{"$error":"#REF!"}},{"$error":"#REF!"},{"$f":"IF(I53=\"\",\"\",VLOOKUP(I53,#REF!,7,FALSE))","v":{"$error":"#REF!"}},{"$error":"#REF!"},{"$f":"IF(K53=\"\",\"\",VLOOKUP(K53,#REF!,7,FALSE))","v":{"$error":"#REF!"}},{"$error":"#REF!"},{"$error":"#REF!"}]
[{"$f":"IF(ISNA(VLOOKUP(B54,#REF!,3,FALSE))=TRUE,\"\",VLOOKUP(B54,#REF!,3,FALSE))","v":{"$error":"#REF!"}},26,{"$f":"VLOOKUP(B54,#REF!,6,FALSE)","v":{"$error":"#REF!"}},{"$f":"IF(C54=\"\",\"\",VLOOKUP(C54,#REF!,7,FALSE))","v":{"$error":"#REF!"}},{"$error":"#REF!"},{"$f":"IF(E54=\"\",\"\",VLOOKUP(E54,#REF!,7,FALSE))","v":{"$error":"#REF!"}},{"$error":"#REF!"},{"$f":"IF(G54=\"\",\"\",VLOOKUP(G54,#REF!,7,FALSE))","v":{"$error":"#REF!"}},{"$error":"#REF!"},{"$f":"IF(I54=\"\",\"\",VLOOKUP(I54,#REF!,7,FALSE))","v":{"$error":"#REF!"}},{"$error":"#REF!"},{"$f":"IF(K54=\"\",\"\",VLOOKUP(K54,#REF!,7,FALSE))","v":{"$error":"#REF!"}},{"$error":"#REF!"},{"$error":"#REF!"}]
[{"$f":"IF(ISNA(VLOOKUP(B55,#REF!,3,FALSE))=TRUE,\"\",VLOOKUP(B55,#REF!,3,FALSE))","v":{"$error":"#REF!"}},14,{"$f":"VLOOKUP(B55,#REF!,6,FALSE)","v":{"$error":"#REF!"}},{"$f":"IF(C55=\"\",\"\",VLOOKUP(C55,#REF!,7,FALSE))","v":{"$error":"#REF!"}},{"$error":"#REF!"},{"$f":"IF(E55=\"\",\"\",VLOOKUP(E55,#REF!,7,FALSE))","v":{"$error":"#REF!"}},{"$error":"#REF!"},{"$f":"IF(G55=\"\",\"\",VLOOKUP(G55,#REF!,7,FALSE))","v":{"$error":"#REF!"}},{"$error":"#REF!"},{"$f":"IF(I55=\"\",\"\",VLOOKUP(I55,#REF!,7,FALSE))","v":{"$error":"#REF!"}},{"$error":"#REF!"},{"$f":"IF(K55=\"\",\"\",VLOOKUP(K55,#REF!,7,FALSE))","v":{"$error":"#REF!"}},{"$error":"#REF!"},{"$error":"#REF!"}]
[{"$f":"IF(ISNA(VLOOKUP(B56,#REF!,3,FALSE))=TRUE,\"\",VLOOKUP(B56,#REF!,3,FALSE))","v":{"$error":"#REF!"}},28,{"$f":"VLOOKUP(B56,#REF!,6,FALSE)","v":{"$error":"#REF!"}},{"$f":"IF(C56=\"\",\"\",VLOOKUP(C56,#REF!,7,FALSE))","v":{"$error":"#REF!"}},{"$error":"#REF!"},{"$f":"IF(E56=\"\",\"\",VLOOKUP(E56,#REF!,7,FALSE))","v":{"$error":"#REF!"}},{"$error":"#REF!"},{"$f":"IF(G56=\"\",\"\",VLOOKUP(G56,#REF!,7,FALSE))","v":{"$error":"#REF!"}},{"$error":"#REF!"},{"$f":"IF(I56=\"\",\"\",VLOOKUP(I56,#REF!,7,FALSE))","v":{"$error":"#REF!"}},{"$error":"#REF!"},{"$f":"IF(K56=\"\",\"\",VLOOKUP(K56,#REF!,7,FALSE))","v":{"$error":"#REF!"}},{"$error":"#REF!"},{"$error":"#REF!"}]
[{"$f":"IF(ISNA(VLOOKUP(B57,#REF!,3,FALSE))=TRUE,\"\",VLOOKUP(B57,#REF!,3,FALSE))","v":{"$error":"#REF!"}},4,{"$f":"VLOOKUP(B57,#REF!,6,FALSE)","v":{"$error":"#REF!"}},{"$f":"IF(C57=\"\",\"\",VLOOKUP(C57,#REF!,7,FALSE))","v":{"$error":"#REF!"}},{"$error":"#REF!"},{"$f":"IF(E57=\"\",\"\",VLOOKUP(E57,#REF!,7,FALSE))","v":{"$error":"#REF!"}},{"$error":"#REF!"},{"$f":"IF(G57=\"\",\"\",VLOOKUP(G57,#REF!,7,FALSE))","v":{"$error":"#REF!"}},{"$error":"#REF!"},{"$f":"IF(I57=\"\",\"\",VLOOKUP(I57,#REF!,7,FALSE))","v":{"$error":"#REF!"}},{"$error":"#REF!"},{"$f":"IF(K57=\"\",\"\",VLOOKUP(K57,#REF!,7,FALSE))","v":{"$error":"#REF!"}},{"$error":"#REF!"},{"$error":"#REF!"}]
[{"$f":"IF(ISNA(VLOOKUP(B58,#REF!,3,FALSE))=TRUE,\"\",VLOOKUP(B58,#REF!,3,FALSE))","v":{"$error":"#REF!"}},21,{"$f":"VLOOKUP(B58,#REF!,6,FALSE)","v":{"$error":"#REF!"}},{"$f":"IF(C58=\"\",\"\",VLOOKUP(C58,#REF!,7,FALSE))","v":{"$error":"#REF!"}},{"$error":"#REF!"},{"$f":"IF(E58=\"\",\"\",VLOOKUP(E58,#REF!,7,FALSE))","v":{"$error":"#REF!"}},{"$error":"#REF!"},{"$f":"IF(G58=\"\",\"\",VLOOKUP(G58,#REF!,7,FALSE))","v":{"$error":"#REF!"}},{"$error":"#REF!"},{"$f":"IF(I58=\"\",\"\",VLOOKUP(I58,#REF!,7,FALSE))","v":{"$error":"#REF!"}},{"$error":"#REF!"},{"$f":"IF(K58=\"\",\"\",VLOOKUP(K58,#REF!,7,FALSE))","v":{"$error":"#REF!"}},{"$error":"#REF!"},{"$error":"#REF!"}]
[{"$f":"IF(ISNA(VLOOKUP(B59,#REF!,3,FALSE))=TRUE,\"\",VLOOKUP(B59,#REF!,3,FALSE))","v":{"$error":"#REF!"}},17,{"$f":"VLOOKUP(B59,#REF!,6,FALSE)","v":{"$error":"#REF!"}},{"$f":"IF(C59=\"\",\"\",VLOOKUP(C59,#REF!,7,FALSE))","v":{"$error":"#REF!"}},{"$error":"#REF!"},{"$f":"IF(E59=\"\",\"\",VLOOKUP(E59,#REF!,7,FALSE))","v":{"$error":"#REF!"}},{"$error":"#REF!"},{"$f":"IF(G59=\"\",\"\",VLOOKUP(G59,#REF!,7,FALSE))","v":{"$error":"#REF!"}},{"$error":"#REF!"},{"$f":"IF(I59=\"\",\"\",VLOOKUP(I59,#REF!,7,FALSE))","v":{"$error":"#REF!"}},{"$error":"#REF!"},{"$f":"IF(K59=\"\",\"\",VLOOKUP(K59,#REF!,7,FALSE))","v":{"$error":"#REF!"}},{"$error":"#REF!"},{"$error":"#REF!"}]
[{"$f":"IF(ISNA(VLOOKUP(B60,#REF!,3,FALSE))=TRUE,\"\",VLOOKUP(B60,#REF!,3,FALSE))","v":{"$error":"#REF!"}},16,{"$f":"VLOOKUP(B60,#REF!,6,FALSE)","v":{"$error":"#REF!"}},{"$f":"IF(C60=\"\",\"\",VLOOKUP(C60,#REF!,7,FALSE))","v":{"$error":"#REF!"}},{"$error":"#REF!"},{"$f":"IF(E60=\"\",\"\",VLOOKUP(E60,#REF!,7,FALSE))","v":{"$error":"#REF!"}},{"$error":"#REF!"},{"$f":"IF(G60=\"\",\"\",VLOOKUP(G60,#REF!,7,FALSE))","v":{"$error":"#REF!"}},{"$error":"#REF!"},{"$f":"IF(I60=\"\",\"\",VLOOKUP(I60,#REF!,7,FALSE))","v":{"$error":"#REF!"}},{"$error":"#REF!"},{"$f":"IF(K60=\"\",\"\",VLOOKUP(K60,#REF!,7,FALSE))","v":{"$error":"#REF!"}},{"$error":"#REF!"},{"$error":"#REF!"}]
[{"$f":"IF(ISNA(VLOOKUP(B61,#REF!,3,FALSE))=TRUE,\"\",VLOOKUP(B61,#REF!,3,FALSE))","v":{"$error":"#REF!"}},25,{"$f":"VLOOKUP(B61,#REF!,6,FALSE)","v":{"$error":"#REF!"}},{"$f":"IF(C61=\"\",\"\",VLOOKUP(C61,#REF!,7,FALSE))","v":{"$error":"#REF!"}},{"$error":"#REF!"},{"$f":"IF(E61=\"\",\"\",VLOOKUP(E61,#REF!,7,FALSE))","v":{"$error":"#REF!"}},{"$error":"#REF!"},{"$f":"IF(G61=\"\",\"\",VLOOKUP(G61,#REF!,7,FALSE))","v":{"$error":"#REF!"}},{"$error":"#REF!"},{"$f":"IF(I61=\"\",\"\",VLOOKUP(I61,#REF!,7,FALSE))","v":{"$error":"#REF!"}},{"$error":"#REF!"},{"$f":"IF(K61=\"\",\"\",VLOOKUP(K61,#REF!,7,FALSE))","v":{"$error":"#REF!"}},{"$error":"#REF!"},{"$error":"#REF!"}]
[{"$f":"IF(ISNA(VLOOKUP(B62,#REF!,3,FALSE))=TRUE,\"\",VLOOKUP(B62,#REF!,3,FALSE))","v":{"$error":"#REF!"}},19,{"$f":"VLOOKUP(B62,#REF!,6,FALSE)","v":{"$error":"#REF!"}},{"$f":"IF(C62=\"\",\"\",VLOOKUP(C62,#REF!,7,FALSE))","v":{"$error":"#REF!"}},{"$error":"#REF!"},{"$f":"IF(E62=\"\",\"\",VLOOKUP(E62,#REF!,7,FALSE))","v":{"$error":"#REF!"}},{"$error":"#REF!"},{"$f":"IF(G62=\"\",\"\",VLOOKUP(G62,#REF!,7,FALSE))","v":{"$error":"#REF!"}},{"$error":"#REF!"},{"$f":"IF(I62=\"\",\"\",VLOOKUP(I62,#REF!,7,FALSE))","v":{"$error":"#REF!"}},{"$error":"#REF!"},{"$f":"IF(K62=\"\",\"\",VLOOKUP(K62,#REF!,7,FALSE))","v":{"$error":"#REF!"}},{"$f":"IF(B62=\"\",\"\",(D62+F62+H62+J62+L62))","v":{"$error":"#REF!"}},{"$error":"#REF!"}]
[{"$f":"IF(ISNA(VLOOKUP(B63,#REF!,3,FALSE))=TRUE,\"\",VLOOKUP(B63,#REF!,3,FALSE))","v":{"$error":"#REF!"}},3,{"$f":"VLOOKUP(B63,#REF!,6,FALSE)","v":{"$error":"#REF!"}},{"$f":"IF(C63=\"\",\"\",VLOOKUP(C63,#REF!,7,FALSE))","v":{"$error":"#REF!"}},{"$error":"#REF!"},{"$f":"IF(E63=\"\",\"\",VLOOKUP(E63,#REF!,7,FALSE))","v":{"$error":"#REF!"}},{"$error":"#REF!"},{"$f":"IF(G63=\"\",\"\",VLOOKUP(G63,#REF!,7,FALSE))","v":{"$error":"#REF!"}},{"$error":"#REF!"},{"$f":"IF(I63=\"\",\"\",VLOOKUP(I63,#REF!,7,FALSE))","v":{"$error":"#REF!"}},{"$error":"#REF!"},{"$f":"IF(K63=\"\",\"\",VLOOKUP(K63,#REF!,7,FALSE))","v":{"$error":"#REF!"}},{"$error":"#REF!"},{"$error":"#REF!"}]
[{"$f":"IF(ISNA(VLOOKUP(B64,#REF!,3,FALSE))=TRUE,\"\",VLOOKUP(B64,#REF!,3,FALSE))","v":{"$error":"#REF!"}},5,{"$f":"VLOOKUP(B64,#REF!,6,FALSE)","v":{"$error":"#REF!"}},{"$f":"IF(C64=\"\",\"\",VLOOKUP(C64,#REF!,7,FALSE))","v":{"$error":"#REF!"}},{"$error":"#REF!"},{"$f":"IF(E64=\"\",\"\",VLOOKUP(E64,#REF!,7,FALSE))","v":{"$error":"#REF!"}},{"$error":"#REF!"},{"$f":"IF(G64=\"\",\"\",VLOOKUP(G64,#REF!,7,FALSE))","v":{"$error":"#REF!"}},{"$error":"#REF!"},{"$f":"IF(I64=\"\",\"\",VLOOKUP(I64,#REF!,7,FALSE))","v":{"$error":"#REF!"}},{"$error":"#REF!"},{"$f":"IF(K64=\"\",\"\",VLOOKUP(K64,#REF!,7,FALSE))","v":{"$error":"#REF!"}},{"$error":"#REF!"},{"$error":"#REF!"}]
[{"$f":"IF(ISNA(VLOOKUP(B65,#REF!,3,FALSE))=TRUE,\"\",VLOOKUP(B65,#REF!,3,FALSE))","v":{"$error":"#REF!"}},6,{"$f":"VLOOKUP(B65,#REF!,6,FALSE)","v":{"$error":"#REF!"}},{"$f":"IF(C65=\"\",\"\",VLOOKUP(C65,#REF!,7,FALSE))","v":{"$error":"#REF!"}},{"$error":"#REF!"},{"$f":"IF(E65=\"\",\"\",VLOOKUP(E65,#REF!,7,FALSE))","v":{"$error":"#REF!"}},{"$error":"#REF!"},{"$f":"IF(G65=\"\",\"\",VLOOKUP(G65,#REF!,7,FALSE))","v":{"$error":"#REF!"}},{"$error":"#REF!"},{"$f":"IF(I65=\"\",\"\",VLOOKUP(I65,#REF!,7,FALSE))","v":{"$error":"#REF!"}},{"$error":"#REF!"},{"$f":"IF(K65=\"\",\"\",VLOOKUP(K65,#REF!,7,FALSE))","v":{"$error":"#REF!"}},{"$error":"#REF!"},{"$error":"#REF!"}]
[{"$f":"IF(ISNA(VLOOKUP(B66,#REF!,3,FALSE))=TRUE,\"\",VLOOKUP(B66,#REF!,3,FALSE))","v":{"$error":"#REF!"}},7,{"$f":"VLOOKUP(B66,#REF!,6,FALSE)","v":{"$error":"#REF!"}},{"$f":"IF(C66=\"\",\"\",VLOOKUP(C66,#REF!,7,FALSE))","v":{"$error":"#REF!"}},{"$error":"#REF!"},{"$f":"IF(E66=\"\",\"\",VLOOKUP(E66,#REF!,7,FALSE))","v":{"$error":"#REF!"}},{"$error":"#REF!"},{"$f":"IF(G66=\"\",\"\",VLOOKUP(G66,#REF!,7,FALSE))","v":{"$error":"#REF!"}},{"$error":"#REF!"},{"$f":"IF(I66=\"\",\"\",VLOOKUP(I66,#REF!,7,FALSE))","v":{"$error":"#REF!"}},{"$error":"#REF!"},{"$f":"IF(K66=\"\",\"\",VLOOKUP(K66,#REF!,7,FALSE))","v":{"$error":"#REF!"}},{"$error":"#REF!"},{"$error":"#REF!"}]
[{"$f":"IF(ISNA(VLOOKUP(B67,#REF!,3,FALSE))=TRUE,\"\",VLOOKUP(B67,#REF!,3,FALSE))","v":{"$error":"#REF!"}},8,{"$f":"VLOOKUP(B67,#REF!,6,FALSE)","v":{"$error":"#REF!"}},{"$f":"IF(C67=\"\",\"\",VLOOKUP(C67,#REF!,7,FALSE))","v":{"$error":"#REF!"}},{"$error":"#REF!"},{"$f":"IF(E67=\"\",\"\",VLOOKUP(E67,#REF!,7,FALSE))","v":{"$error":"#REF!"}},{"$error":"#REF!"},{"$f":"IF(G67=\"\",\"\",VLOOKUP(G67,#REF!,7,FALSE))","v":{"$error":"#REF!"}},{"$error":"#REF!"},{"$f":"IF(I67=\"\",\"\",VLOOKUP(I67,#REF!,7,FALSE))","v":{"$error":"#REF!"}},{"$error":"#REF!"},{"$f":"IF(K67=\"\",\"\",VLOOKUP(K67,#REF!,7,FALSE))","v":{"$error":"#REF!"}},{"$error":"#REF!"},{"$error":"#REF!"}]
[{"$f":"IF(ISNA(VLOOKUP(B68,#REF!,3,FALSE))=TRUE,\"\",VLOOKUP(B68,#REF!,3,FALSE))","v":{"$error":"#REF!"}},13,{"$f":"VLOOKUP(B68,#REF!,6,FALSE)","v":{"$error":"#REF!"}},{"$f":"IF(C68=\"\",\"\",VLOOKUP(C68,#REF!,7,FALSE))","v":{"$error":"#REF!"}},{"$error":"#REF!"},{"$f":"IF(E68=\"\",\"\",VLOOKUP(E68,#REF!,7,FALSE))","v":{"$error":"#REF!"}},{"$error":"#REF!"},{"$f":"IF(G68=\"\",\"\",VLOOKUP(G68,#REF!,7,FALSE))","v":{"$error":"#REF!"}},{"$error":"#REF!"},{"$f":"IF(I68=\"\",\"\",VLOOKUP(I68,#REF!,7,FALSE))","v":{"$error":"#REF!"}},{"$error":"#REF!"},{"$f":"IF(K68=\"\",\"\",VLOOKUP(K68,#REF!,7,FALSE))","v":{"$error":"#REF!"}},{"$error":"#REF!"},{"$error":"#REF!"}]
[{"$f":"IF(ISNA(VLOOKUP(B69,#REF!,3,FALSE))=TRUE,\"\",VLOOKUP(B69,#REF!,3,FALSE))","v":{"$error":"#REF!"}},18,{"$f":"VLOOKUP(B69,#REF!,6,FALSE)","v":{"$error":"#REF!"}},{"$f":"IF(C69=\"\",\"\",VLOOKUP(C69,#REF!,7,FALSE))","v":{"$error":"#REF!"}},{"$error":"#REF!"},{"$f":"IF(E69=\"\",\"\",VLOOKUP(E69,#REF!,7,FALSE))","v":{"$error":"#REF!"}},{"$error":"#REF!"},{"$f":"IF(G69=\"\",\"\",VLOOKUP(G69,#REF!,7,FALSE))","v":{"$error":"#REF!"}},{"$error":"#REF!"},{"$f":"IF(I69=\"\",\"\",VLOOKUP(I69,#REF!,7,FALSE))","v":{"$error":"#REF!"}},{"$error":"#REF!"},{"$f":"IF(K69=\"\",\"\",VLOOKUP(K69,#REF!,7,FALSE))","v":{"$error":"#REF!"}},{"$error":"#REF!"},{"$error":"#REF!"}]
[{"$f":"IF(ISNA(VLOOKUP(B70,#REF!,3,FALSE))=TRUE,\"\",VLOOKUP(B70,#REF!,3,FALSE))","v":{"$error":"#REF!"}},23,{"$f":"VLOOKUP(B70,#REF!,6,FALSE)","v":{"$error":"#REF!"}},{"$f":"IF(C70=\"\",\"\",VLOOKUP(C70,#REF!,7,FALSE))","v":{"$error":"#REF!"}},{"$error":"#REF!"},{"$f":"IF(E70=\"\",\"\",VLOOKUP(E70,#REF!,7,FALSE))","v":{"$error":"#REF!"}},{"$error":"#REF!"},{"$f":"IF(G70=\"\",\"\",VLOOKUP(G70,#REF!,7,FALSE))","v":{"$error":"#REF!"}},{"$error":"#REF!"},{"$f":"IF(I70=\"\",\"\",VLOOKUP(I70,#REF!,7,FALSE))","v":{"$error":"#REF!"}},{"$error":"#REF!"},{"$f":"IF(K70=\"\",\"\",VLOOKUP(K70,#REF!,7,FALSE))","v":{"$error":"#REF!"}},{"$error":"#REF!"},{"$error":"#REF!"}]
["Day 2 Zone Winner",null,"A. PRICE",null,"DAVE READ",null,"FRANCIS JONES",null,"SIMON DRAYTON",null,"CRAIG BUY"]
["Day 2 Zone Winner",null,null,null,"A. HUTCHINGS"]
["Day 2 Zone Second",null,"IAN DAVIS",null,null,null,"BRADLEY BONE",null,"JOE ARCH",null,"ALLAN SMITH"]
["Day 2 Zone Third",null,"MARK SHARMAN",null,"RICHARD POTTS",null,"IAN BELLFIELD",null,"MARK VERINDER",null,"JAMES BROWN"]
["Day 2 Zone Third",null,"GERRY BELL"]
["SAMF 2006 National Sea League Final  -  Final Positions"]
["Team Name","Team No. ","Day 1 Points","Day 2 Points","Total Points","Overall Position"]
[]
[{"$f":"IF(ISNA(VLOOKUP(B79,#REF!,3,FALSE))=TRUE,\"\",VLOOKUP(B79,#REF!,3,FALSE))","v":{"$error":"#REF!"}},12,{"$f":"VLOOKUP(B79,$B$4:$M$32,12,FALSE)","v":{"$error":"#REF!"}},{"$f":"VLOOKUP(B79,$B$41:$M$70,12,FALSE)","v":{"$error":"#REF!"}},{"$f":"IF(B79=\"\",\"\",(C79+D79))","v":{"$error":"#REF!"}},{"$f":"IF(E79=\"\",\"\",IF(E79=E78,F78,ROW()-78))","v":{"$error":"#REF!"}}]
[{"$f":"IF(ISNA(VLOOKUP(B80,#REF!,3,FALSE))=TRUE,\"\",VLOOKUP(B80,#REF!,3,FALSE))","v":{"$error":"#REF!"}},11,{"$error":"#REF!"},{"$error":"#REF!"},{"$error":"#REF!"},{"$f":"IF(E80=\"\",\"\",IF(E80=E79,F79,ROW()-78))","v":{"$error":"#REF!"}}]
[{"$f":"IF(ISNA(VLOOKUP(B81,#REF!,3,FALSE))=TRUE,\"\",VLOOKUP(B81,#REF!,3,FALSE))","v":{"$error":"#REF!"}},9,{"$error":"#REF!"},{"$error":"#REF!"},{"$error":"#REF!"},{"$error":"#REF!"}]
[{"$f":"IF(ISNA(VLOOKUP(B82,#REF!,3,FALSE))=TRUE,\"\",VLOOKUP(B82,#REF!,3,FALSE))","v":{"$error":"#REF!"}},30,{"$error":"#REF!"},{"$error":"#REF!"},{"$error":"#REF!"},{"$error":"#REF!"}]
[{"$f":"IF(ISNA(VLOOKUP(B83,#REF!,3,FALSE))=TRUE,\"\",VLOOKUP(B83,#REF!,3,FALSE))","v":{"$error":"#REF!"}},10,{"$error":"#REF!"},{"$error":"#REF!"},{"$error":"#REF!"},{"$error":"#REF!"}]
[{"$f":"IF(ISNA(VLOOKUP(B84,#REF!,3,FALSE))=TRUE,\"\",VLOOKUP(B84,#REF!,3,FALSE))","v":{"$error":"#REF!"}},20,{"$error":"#REF!"},{"$error":"#REF!"},{"$error":"#REF!"},{"$error":"#REF!"}]
[{"$f":"IF(ISNA(VLOOKUP(B85,#REF!,3,FALSE))=TRUE,\"\",VLOOKUP(B85,#REF!,3,FALSE))","v":{"$error":"#REF!"}},27,{"$error":"#REF!"},{"$error":"#REF!"},{"$error":"#REF!"},{"$error":"#REF!"}]
[{"$f":"IF(ISNA(VLOOKUP(B86,#REF!,3,FALSE))=TRUE,\"\",VLOOKUP(B86,#REF!,3,FALSE))","v":{"$error":"#REF!"}},22,{"$error":"#REF!"},{"$error":"#REF!"},{"$error":"#REF!"},{"$error":"#REF!"}]
[{"$f":"IF(ISNA(VLOOKUP(B87,#REF!,3,FALSE))=TRUE,\"\",VLOOKUP(B87,#REF!,3,FALSE))","v":{"$error":"#REF!"}},26,{"$error":"#REF!"},{"$error":"#REF!"},{"$error":"#REF!"},{"$error":"#REF!"}]
[{"$f":"IF(ISNA(VLOOKUP(B88,#REF!,3,FALSE))=TRUE,\"\",VLOOKUP(B88,#REF!,3,FALSE))","v":{"$error":"#REF!"}},2,{"$error":"#REF!"},{"$error":"#REF!"},{"$error":"#REF!"},{"$error":"#REF!"}]
[{"$f":"IF(ISNA(VLOOKUP(B89,#REF!,3,FALSE))=TRUE,\"\",VLOOKUP(B89,#REF!,3,FALSE))","v":{"$error":"#REF!"}},4,{"$error":"#REF!"},{"$error":"#REF!"},{"$error":"#REF!"},{"$error":"#REF!"}]
[{"$f":"IF(ISNA(VLOOKUP(B90,#REF!,3,FALSE))=TRUE,\"\",VLOOKUP(B90,#REF!,3,FALSE))","v":{"$error":"#REF!"}},21,{"$error":"#REF!"},{"$error":"#REF!"},{"$error":"#REF!"},{"$error":"#REF!"}]
[{"$f":"IF(ISNA(VLOOKUP(B91,#REF!,3,FALSE))=TRUE,\"\",VLOOKUP(B91,#REF!,3,FALSE))","v":{"$error":"#REF!"}},1,{"$f":"VLOOKUP(B91,$B$4:$M$32,12,FALSE)","v":{"$error":"#REF!"}},{"$f":"VLOOKUP(B91,$B$41:$M$70,12,FALSE)","v":{"$error":"#REF!"}},{"$f":"IF(B91=\"\",\"\",(C91+D91))","v":{"$error":"#REF!"}},{"$error":"#REF!"}]
[{"$f":"IF(ISNA(VLOOKUP(B92,#REF!,3,FALSE))=TRUE,\"\",VLOOKUP(B92,#REF!,3,FALSE))","v":{"$error":"#REF!"}},28,{"$error":"#REF!"},{"$error":"#REF!"},{"$error":"#REF!"},{"$error":"#REF!"}]
[{"$f":"IF(ISNA(VLOOKUP(B93,#REF!,3,FALSE))=TRUE,\"\",VLOOKUP(B93,#REF!,3,FALSE))","v":{"$error":"#REF!"}},29,{"$error":"#REF!"},{"$f":"VLOOKUP(B93,$B$41:$M$70,12,FALSE)","v":{"$error":"#REF!"}},{"$f":"IF(B93=\"\",\"\",(C93+D93))","v":{"$error":"#REF!"}},{"$error":"#REF!"}]
[{"$f":"IF(ISNA(VLOOKUP(B94,#REF!,3,FALSE))=TRUE,\"\",VLOOKUP(B94,#REF!,3,FALSE))","v":{"$error":"#REF!"}},25,{"$error":"#REF!"},{"$error":"#REF!"},{"$error":"#REF!"},{"$error":"#REF!"}]
[{"$f":"IF(ISNA(VLOOKUP(B95,#REF!,3,FALSE))=TRUE,\"\",VLOOKUP(B95,#REF!,3,FALSE))","v":{"$error":"#REF!"}},17,{"$error":"#REF!"},{"$error":"#REF!"},{"$error":"#REF!"},{"$error":"#REF!"}]
[{"$f":"IF(ISNA(VLOOKUP(B96,#REF!,3,FALSE))=TRUE,\"\",VLOOKUP(B96,#REF!,3,FALSE))","v":{"$error":"#REF!"}},24,{"$error":"#REF!"},{"$error":"#REF!"},{"$error":"#REF!"},{"$error":"#REF!"}]
[{"$f":"IF(ISNA(VLOOKUP(B97,#REF!,3,FALSE))=TRUE,\"\",VLOOKUP(B97,#REF!,3,FALSE))","v":{"$error":"#REF!"}},15,{"$error":"#REF!"},{"$error":"#REF!"},{"$error":"#REF!"},{"$error":"#REF!"}]
[{"$f":"IF(ISNA(VLOOKUP(B98,#REF!,3,FALSE))=TRUE,\"\",VLOOKUP(B98,#REF!,3,FALSE))","v":{"$error":"#REF!"}},14,{"$error":"#REF!"},{"$error":"#REF!"},{"$error":"#REF!"},{"$error":"#REF!"}]
[{"$f":"IF(ISNA(VLOOKUP(B99,#REF!,3,FALSE))=TRUE,\"\",VLOOKUP(B99,#REF!,3,FALSE))","v":{"$error":"#REF!"}},16,{"$error":"#REF!"},{"$error":"#REF!"},{"$error":"#REF!"},{"$error":"#REF!"}]
[{"$f":"IF(ISNA(VLOOKUP(B100,#REF!,3,FALSE))=TRUE,\"\",VLOOKUP(B100,#REF!,3,FALSE))","v":{"$error":"#REF!"}},6,{"$error":"#REF!"},{"$error":"#REF!"},{"$error":"#REF!"},{"$error":"#REF!"}]
[{"$f":"IF(ISNA(VLOOKUP(B101,#REF!,3,FALSE))=TRUE,\"\",VLOOKUP(B101,#REF!,3,FALSE))","v":{"$error":"#REF!"}},19,{"$error":"#REF!"},{"$error":"#REF!"},{"$error":"#REF!"},{"$error":"#REF!"}]
[{"$f":"IF(ISNA(VLOOKUP(B102,#REF!,3,FALSE))=TRUE,\"\",VLOOKUP(B102,#REF!,3,FALSE))","v":{"$error":"#REF!"}},23,{"$error":"#REF!"},{"$error":"#REF!"},{"$error":"#REF!"},{"$error":"#REF!"}]
[{"$f":"IF(ISNA(VLOOKUP(B103,#REF!,3,FALSE))=TRUE,\"\",VLOOKUP(B103,#REF!,3,FALSE))","v":{"$error":"#REF!"}},18,{"$error":"#REF!"},{"$error":"#REF!"},{"$error":"#REF!"},{"$error":"#REF!"}]
[{"$f":"IF(ISNA(VLOOKUP(B104,#REF!,3,FALSE))=TRUE,\"\",VLOOKUP(B104,#REF!,3,FALSE))","v":{"$error":"#REF!"}},7,{"$error":"#REF!"},{"$error":"#REF!"},{"$error":"#REF!"},{"$error":"#REF!"}]
[{"$f":"IF(ISNA(VLOOKUP(B105,#REF!,3,FALSE))=TRUE,\"\",VLOOKUP(B105,#REF!,3,FALSE))","v":{"$error":"#REF!"}},3,{"$error":"#REF!"},{"$error":"#REF!"},{"$error":"#REF!"},{"$error":"#REF!"}]
[{"$f":"IF(ISNA(VLOOKUP(B106,#REF!,3,FALSE))=TRUE,\"\",VLOOKUP(B106,#REF!,3,FALSE))","v":{"$error":"#REF!"}},5,{"$error":"#REF!"},{"$error":"#REF!"},{"$error":"#REF!"},{"$error":"#REF!"}]
[{"$f":"IF(ISNA(VLOOKUP(B107,#REF!,3,FALSE))=TRUE,\"\",VLOOKUP(B107,#REF!,3,FALSE))","v":{"$error":"#REF!"}},8,{"$error":"#REF!"},{"$f":"VLOOKUP(B107,$B$41:$M$70,12,FALSE)","v":{"$error":"#REF!"}},{"$f":"IF(B107=\"\",\"\",(C107+D107))","v":{"$error":"#REF!"}},{"$error":"#REF!"}]
[{"$f":"IF(ISNA(VLOOKUP(B108,#REF!,3,FALSE))=TRUE,\"\",VLOOKUP(B108,#REF!,3,FALSE))","v":{"$error":"#REF!"}},13,{"$f":"VLOOKUP(B108,$B$4:$M$33,12,FALSE)","v":{"$error":"#REF!"}},{"$f":"VLOOKUP(B108,$B$41:$M$70,12,FALSE)","v":{"$error":"#REF!"}},{"$f":"IF(B108=\"\",\"\",(C108+D108))","v":{"$error":"#REF!"}},{"$error":"#REF!"}]
[{"$f":"IF(ISNA(VLOOKUP(B109,#REF!,2,FALSE))=TRUE,\"\",VLOOKUP(B109,#REF!,2,FALSE))","v":{"$error":"#REF!"}}]

{"sheet":"Final team results","index":1,"n_rows":31,"n_cols":6,"rows_kept":31,"cut":false,"hidden":true,"merged":[[1,5,2,5],[1,4,2,4],[1,0,2,0],[1,1,2,1],[1,2,2,2],[1,3,2,3]]}
["SAMF 2006 National Sea League Final  -  Final Positions"]
["Team Name","Team No. ","Day 1 Points","Day 2 Points","Total Points","Overall Position"]
[]
[{"$f":"'Auto Team results'!A79","v":{"$error":"#REF!"}},{"$f":"'Auto Team results'!B79","v":12},{"$f":"'Auto Team results'!C79","v":{"$error":"#REF!"}},{"$f":"'Auto Team results'!D79","v":{"$error":"#REF!"}},{"$f":"IF(B4=\"\",\"\",(C4+D4))","v":{"$error":"#REF!"}},{"$f":"IF(E4=\"\",\"\",IF(E4=E3,F3,ROW()-3))","v":{"$error":"#REF!"}}]
[{"$f":"'Auto Team results'!A80","v":{"$error":"#REF!"}},{"$f":"'Auto Team results'!B80","v":11},{"$f":"'Auto Team results'!C80","v":{"$error":"#REF!"}},{"$f":"'Auto Team results'!D80","v":{"$error":"#REF!"}},{"$f":"IF(B5=\"\",\"\",(C5+D5))","v":{"$error":"#REF!"}},{"$f":"IF(E5=\"\",\"\",IF(E5=E4,F4,ROW()-3))","v":{"$error":"#REF!"}}]
[{"$f":"'Auto Team results'!A81","v":{"$error":"#REF!"}},{"$f":"'Auto Team results'!B81","v":9},{"$f":"'Auto Team results'!C81","v":{"$error":"#REF!"}},{"$f":"'Auto Team results'!D81","v":{"$error":"#REF!"}},{"$error":"#REF!"},{"$error":"#REF!"}]
[{"$f":"'Auto Team results'!A82","v":{"$error":"#REF!"}},{"$f":"'Auto Team results'!B82","v":30},{"$f":"'Auto Team results'!C82","v":{"$error":"#REF!"}},{"$f":"'Auto Team results'!D82","v":{"$error":"#REF!"}},{"$error":"#REF!"},{"$error":"#REF!"}]
[{"$f":"'Auto Team results'!A83","v":{"$error":"#REF!"}},{"$f":"'Auto Team results'!B83","v":10},{"$f":"'Auto Team results'!C83","v":{"$error":"#REF!"}},{"$f":"'Auto Team results'!D83","v":{"$error":"#REF!"}},{"$error":"#REF!"},{"$error":"#REF!"}]
[{"$f":"'Auto Team results'!A84","v":{"$error":"#REF!"}},{"$f":"'Auto Team results'!B84","v":20},{"$f":"'Auto Team results'!C84","v":{"$error":"#REF!"}},{"$f":"'Auto Team results'!D84","v":{"$error":"#REF!"}},{"$error":"#REF!"},{"$error":"#REF!"}]
[{"$f":"'Auto Team results'!A85","v":{"$error":"#REF!"}},{"$f":"'Auto Team results'!B85","v":27},{"$f":"'Auto Team results'!C85","v":{"$error":"#REF!"}},{"$f":"'Auto Team results'!D85","v":{"$error":"#REF!"}},{"$error":"#REF!"},{"$error":"#REF!"}]
[{"$f":"'Auto Team results'!A86","v":{"$error":"#REF!"}},{"$f":"'Auto Team results'!B86","v":22},{"$f":"'Auto Team results'!C86","v":{"$error":"#REF!"}},{"$f":"'Auto Team results'!D86","v":{"$error":"#REF!"}},{"$error":"#REF!"},{"$error":"#REF!"}]
[{"$f":"'Auto Team results'!A87","v":{"$error":"#REF!"}},{"$f":"'Auto Team results'!B87","v":26},{"$f":"'Auto Team results'!C87","v":{"$error":"#REF!"}},{"$f":"'Auto Team results'!D87","v":{"$error":"#REF!"}},{"$error":"#REF!"},{"$error":"#REF!"}]
[{"$f":"'Auto Team results'!A88","v":{"$error":"#REF!"}},{"$f":"'Auto Team results'!B88","v":2},{"$f":"'Auto Team results'!C88","v":{"$error":"#REF!"}},{"$f":"'Auto Team results'!D88","v":{"$error":"#REF!"}},{"$error":"#REF!"},{"$error":"#REF!"}]
[{"$f":"'Auto Team results'!A89","v":{"$error":"#REF!"}},{"$f":"'Auto Team results'!B89","v":4},{"$f":"'Auto Team results'!C89","v":{"$error":"#REF!"}},{"$f":"'Auto Team results'!D89","v":{"$error":"#REF!"}},{"$error":"#REF!"},{"$error":"#REF!"}]
[{"$f":"'Auto Team results'!A90","v":{"$error":"#REF!"}},{"$f":"'Auto Team results'!B90","v":21},{"$f":"'Auto Team results'!C90","v":{"$error":"#REF!"}},{"$f":"'Auto Team results'!D90","v":{"$error":"#REF!"}},{"$error":"#REF!"},{"$error":"#REF!"}]
[{"$f":"'Auto Team results'!A91","v":{"$error":"#REF!"}},{"$f":"'Auto Team results'!B91","v":1},{"$f":"'Auto Team results'!C91","v":{"$error":"#REF!"}},{"$f":"'Auto Team results'!D91","v":{"$error":"#REF!"}},{"$error":"#REF!"},{"$error":"#REF!"}]
[{"$f":"'Auto Team results'!A92","v":{"$error":"#REF!"}},{"$f":"'Auto Team results'!B92","v":28},{"$f":"'Auto Team results'!C92","v":{"$error":"#REF!"}},{"$f":"'Auto Team results'!D92","v":{"$error":"#REF!"}},{"$error":"#REF!"},{"$error":"#REF!"}]
[{"$f":"'Auto Team results'!A93","v":{"$error":"#REF!"}},{"$f":"'Auto Team results'!B93","v":29},{"$f":"'Auto Team results'!C93","v":{"$error":"#REF!"}},{"$f":"'Auto Team results'!D93","v":{"$error":"#REF!"}},{"$error":"#REF!"},{"$error":"#REF!"}]
[{"$f":"'Auto Team results'!A94","v":{"$error":"#REF!"}},{"$f":"'Auto Team results'!B94","v":25},{"$f":"'Auto Team results'!C94","v":{"$error":"#REF!"}},{"$f":"'Auto Team results'!D94","v":{"$error":"#REF!"}},{"$error":"#REF!"},{"$error":"#REF!"}]
[{"$f":"'Auto Team results'!A95","v":{"$error":"#REF!"}},{"$f":"'Auto Team results'!B95","v":17},{"$f":"'Auto Team results'!C95","v":{"$error":"#REF!"}},{"$f":"'Auto Team results'!D95","v":{"$error":"#REF!"}},{"$error":"#REF!"},{"$error":"#REF!"}]
[{"$f":"'Auto Team results'!A96","v":{"$error":"#REF!"}},{"$f":"'Auto Team results'!B96","v":24},{"$f":"'Auto Team results'!C96","v":{"$error":"#REF!"}},{"$f":"'Auto Team results'!D96","v":{"$error":"#REF!"}},{"$error":"#REF!"},{"$error":"#REF!"}]
[{"$f":"'Auto Team results'!A97","v":{"$error":"#REF!"}},{"$f":"'Auto Team results'!B97","v":15},{"$f":"'Auto Team results'!C97","v":{"$error":"#REF!"}},{"$f":"'Auto Team results'!D97","v":{"$error":"#REF!"}},{"$error":"#REF!"},{"$error":"#REF!"}]
[{"$f":"'Auto Team results'!A98","v":{"$error":"#REF!"}},{"$f":"'Auto Team results'!B98","v":14},{"$f":"'Auto Team results'!C98","v":{"$error":"#REF!"}},{"$f":"'Auto Team results'!D98","v":{"$error":"#REF!"}},{"$error":"#REF!"},{"$error":"#REF!"}]
[{"$f":"'Auto Team results'!A99","v":{"$error":"#REF!"}},{"$f":"'Auto Team results'!B99","v":16},{"$f":"'Auto Team results'!C99","v":{"$error":"#REF!"}},{"$f":"'Auto Team results'!D99","v":{"$error":"#REF!"}},{"$error":"#REF!"},{"$error":"#REF!"}]
[{"$f":"'Auto Team results'!A100","v":{"$error":"#REF!"}},{"$f":"'Auto Team results'!B100","v":6},{"$f":"'Auto Team results'!C100","v":{"$error":"#REF!"}},{"$f":"'Auto Team results'!D100","v":{"$error":"#REF!"}},{"$error":"#REF!"},{"$error":"#REF!"}]
[{"$f":"'Auto Team results'!A101","v":{"$error":"#REF!"}},{"$f":"'Auto Team results'!B101","v":19},{"$f":"'Auto Team results'!C101","v":{"$error":"#REF!"}},{"$f":"'Auto Team results'!D101","v":{"$error":"#REF!"}},{"$error":"#REF!"},{"$error":"#REF!"}]
[{"$f":"'Auto Team results'!A102","v":{"$error":"#REF!"}},{"$f":"'Auto Team results'!B102","v":23},{"$f":"'Auto Team results'!C102","v":{"$error":"#REF!"}},{"$f":"'Auto Team results'!D102","v":{"$error":"#REF!"}},{"$error":"#REF!"},{"$error":"#REF!"}]
[{"$f":"'Auto Team results'!A103","v":{"$error":"#REF!"}},{"$f":"'Auto Team results'!B103","v":18},{"$f":"'Auto Team results'!C103","v":{"$error":"#REF!"}},{"$f":"'Auto Team results'!D103","v":{"$error":"#REF!"}},{"$error":"#REF!"},{"$error":"#REF!"}]
[{"$f":"'Auto Team results'!A104","v":{"$error":"#REF!"}},{"$f":"'Auto Team results'!B104","v":7},{"$f":"'Auto Team results'!C104","v":{"$error":"#REF!"}},{"$f":"'Auto Team results'!D104","v":{"$error":"#REF!"}},{"$f":"IF(B29=\"\",\"\",(C29+D29))","v":{"$error":"#REF!"}},{"$f":"IF(E29=\"\",\"\",IF(E29=E28,F28,ROW()-3))","v":{"$error":"#REF!"}}]
[{"$f":"'Auto Team results'!A105","v":{"$error":"#REF!"}},{"$f":"'Auto Team results'!B105","v":3},{"$f":"'Auto Team results'!C105","v":{"$error":"#REF!"}},{"$f":"'Auto Team results'!D105","v":{"$error":"#REF!"}},{"$f":"IF(B30=\"\",\"\",(C30+D30))","v":{"$error":"#REF!"}},{"$f":"IF(E30=\"\",\"\",IF(E30=E29,F29,ROW()-3))","v":{"$error":"#REF!"}}]
[{"$f":"'Auto Team results'!A106","v":{"$error":"#REF!"}},{"$f":"'Auto Team results'!B106","v":5},{"$f":"'Auto Team results'!C106","v":{"$error":"#REF!"}},{"$f":"'Auto Team results'!D106","v":{"$error":"#REF!"}},{"$f":"IF(B31=\"\",\"\",(C31+D31))","v":{"$error":"#REF!"}},{"$f":"IF(E31=\"\",\"\",IF(E31=E30,F30,ROW()-3))","v":{"$error":"#REF!"}}]

{"sheet":"Winners Detail ","index":2,"n_rows":54,"n_cols":5,"rows_kept":54,"cut":false,"hidden":false,"merged":[[0,4,1,4],[0,0,1,0],[0,1,1,1],[0,2,1,2],[0,3,1,3],[44,2,44,3],[38,2,38,3],[53,1,53,3]]}
["Angler No."," Angler","BANK DETAILS RECEIVED","PAID","Total Winnings"]
[]
[1,"TUCK, Rob","a","a",860]
[2,"BOND, Darren","a","a",740]
[3,"ROGERS, Mark","a","a",600]
[4,"GARDINER, Gareth","a","a",425]
[5,"WALES, Joe","a","a",365]
[6,"FALK, Dave","a","a",220]
[7,"ROYALL, Tony ","a","a",220]
[8,"GOOCH, Mark","a","a",210]
[9,"ADAMS, Stephen","a","a",200]
[10,"ADAMS, Graham","a","a",180]
[11,"CROSBY, Colin","a","a",180]
[12,"PRICE, Ben","a","a",170]
[13,"CROSBY, Ralf","a","a",160]
[14,"McCOY, Kenny","a","a",160]
[15,"SMITH, George","a","a",155]
[16,"DIAPER, Barry","a","a",130]
[17,"TAYLOR, Mark","a","a",130]
[18,"BURT, Richard","a","a",120]
[19,"WICKS, Maralyn","a","a",120]
[20,"WOOD, Gary","a","a",120]
[21,"RUSSELL, Shane","a","a",110]
[22,"DRAYTON, Simon","a","a",80]
[23,"LINDFIELD, Bill","a","a",80]
[24,"ROPER, Liam","a","a",80]
[25,"TOPPING, Jack","a","a",75]
[26,"LAY-FLURRIE, Matt","a","a",70]
[27,"NANGLE, Karl","a","a",70]
[28,"WRIGHT, Dave","a","a",70]
[29,"LINDFIELD, Heather","a","a",60]
[30,"BANHAM, Mark","a","a",55]
[31,"DOY, Alan","a","a",55]
[32,"COOPER, Sam","a","a",50]
[33,"GALLACHER, Andy","a","a",50]
[34,"JOHNSON, Billy","a","a",50]
[35,"DENHOLM, Paul","a","a",40]
[36,"MOORING, Luke","a","a",40]
[37,"PAGE, Saul","Donated to Lifeboat",null,40]
[38,"SHORTHOUSE, Dave","a","a",40]
[39,"TURNER, Cameron","a","a",40]
[40,"WATTS, Mike","a","a",40]
[41,"BROWN, Kay","a","a",35]
[42,"CUTLER, Neil","a","a",30]
[43,"FRENCH, Julian","Cheque",null,30]
[44,"GASCOIGNE, Robert","a","a",30]
[45,"PLUMSTEAD, Joe","a","a",30]
[46,"RYDER, Edde","a","a",30]
[47,"YALLOP, Stephen","a","a",30]
[48,"LEE, Louise","a","a",25]
[49,"ALDOUS, Brayden","a","a",20]
[50,"DAWBER, Simon","a","a",20]
[51,"HUTSON, Garry","a","a",20]
[null,"TOTAL",null,null,6960]

{"sheet":"Winners table","index":3,"n_rows":147,"n_cols":5,"rows_kept":147,"cut":false,"hidden":false,"merged":[]}
["Winnings No.","Event Category","Prize Description","Prize Amount/ Goods/Trophy (2021)","Winner Name(s)"]
[1,"NORTH NORFOLK BASS FESTIVAL","Day 1 - 3rd Zone A Optional Pools",30,"LAY-FLURRIE, Matt"]
[2,"NORTH NORFOLK BASS FESTIVAL","Day 1 - 2nd Zone A Optional Pools",40,"BURT, Richard"]
[3,"NORTH NORFOLK BASS FESTIVAL","Day 1 - 1st Zone A Optional Pools",70,"WALES, Joe"]
[4,"NORTH NORFOLK BASS FESTIVAL","Day 1 - 3rd Zone B Optional Pools",30,"PLUMSTEAD, Joe"]
[5,"NORTH NORFOLK BASS FESTIVAL","Day 1 - 2nd Zone B Optional Pools",40,"GOOCH, Mark"]
[6,"NORTH NORFOLK BASS FESTIVAL","Day 1 - 1st Zone B Optional Pools",70,"ROGERS, Mark"]
[7,"NORTH NORFOLK BASS FESTIVAL","Day 1 - 3rd Zone C Optional Pools",30,"McCOY, Kenny"]
[8,"NORTH NORFOLK BASS FESTIVAL","Day 1 - 2nd Zone C Optional Pools",40,"DENHOLM, Paul"]
[9,"NORTH NORFOLK BASS FESTIVAL","Day 1 - 1st Zone C Optional Pools",70,"TUCK, Rob"]
[10,"NORTH NORFOLK BASS FESTIVAL","Day 1 - 3rd Zone D Optional Pools",30,"DRAYTON, Simon"]
[11,"NORTH NORFOLK BASS FESTIVAL","Day 1 - 2nd Zone D Optional Pools",40,"SMITH, George"]
[12,"NORTH NORFOLK BASS FESTIVAL","Day 1 - 1st Zone D Optional Pools",70,"BOND, Darren"]
[13,"NORTH NORFOLK BASS FESTIVAL","Day 1 - 3rd Zone E Optional Pools",30,"FRENCH, Julian"]
[14,"NORTH NORFOLK BASS FESTIVAL","Day 1 - 2nd Zone E Optional Pools",40,"NANGLE, Karl"]
[15,"NORTH NORFOLK BASS FESTIVAL","Day 1 - 1st Zone E Optional Pools",70,"RUSSELL, Shane"]
[16,"NORTH NORFOLK BASS FESTIVAL","Day 1 - 3rd Zone F Optional Pools",30,"RYDER, Eddie"]
[17,"NORTH NORFOLK BASS FESTIVAL","Day 1 - 2nd Zone F Optional Pools",40,"DOY, Alan"]
[18,"NORTH NORFOLK BASS FESTIVAL","Day 1 - 1st Zone F Optional Pools",70,"CROSBY, Ralf"]
[19,"NORTH NORFOLK BASS FESTIVAL","Day 1 - 3rd Zone G Optional Pools",30,"WOOD, Gary"]
[20,"NORTH NORFOLK BASS FESTIVAL","Day 1 - 2nd Zone G Optional Pools",40,"ROPER, Liam"]
[21,"NORTH NORFOLK BASS FESTIVAL","Day 1 - 1st Zone G Optional Pools",70,"FALK, Dave"]
[22,"NORTH NORFOLK BASS FESTIVAL","Day 1 - 3rd Zone H Optional Pools",30,"GARDINER, Gareth"]
[23,"NORTH NORFOLK BASS FESTIVAL","Day 1 - 2nd Zone H Optional Pools",40,"WRIGHT, Dave"]
[24,"NORTH NORFOLK BASS FESTIVAL","Day 1 - 1st Zone H Optional Pools",70,"ROYALL, Tony "]
[25,"NORTH NORFOLK JUNIORS TOURNAMENT","Day 1 - Winner","Holt SAC £25 prize","TOPPING, Jack"]
[26,"UK LADIES CHAMPIONSHIPS","Day 1 - Third Place",25,"LINDFIELD, Heather"]
[27,"UK LADIES CHAMPIONSHIPS","Day 1 - Runner Up",35,"BROWN, Kay"]
[28,"UK LADIES CHAMPIONSHIPS","Day 1 - Winner",60,"WICKS, Maralyn"]
[{"$f":"1+A29","v":29},"NORTH NORFOLK BASS FESTIVAL","Day 1 - 1st Zone A",10,"WALES, Joe"]
[{"$f":"1+A30","v":30},"NORTH NORFOLK BASS FESTIVAL","Day 1 - 1st Zone B",10,"ROGERS, Mark"]
[31,"NORTH NORFOLK BASS FESTIVAL","Day 1 - 1st Zone C",10,"TUCK, Rob"]
[32,"NORTH NORFOLK BASS FESTIVAL","Day 1 - 1st Zone D",10,"BOND, Darren"]
[33,"NORTH NORFOLK BASS FESTIVAL","Day 1 - 1st Zone E",10,"RUSSELL, Shane"]
[34,"NORTH NORFOLK BASS FESTIVAL","Day 1 - 1st Zone F",10,"CROSBY, Ralf"]
[35,"NORTH NORFOLK BASS FESTIVAL","Day 1 - 1st Zone G",10,"FALK, Dave"]
[36,"NORTH NORFOLK BASS FESTIVAL","Day 1 - 1st Zone H",10,"ROYALL, Tony "]
[37,"NORTH NORFOLK BASS FESTIVAL","Day 1 - 4th Heaviest Bass Total",30,"BOND, Darren"]
[38,"NORTH NORFOLK BASS FESTIVAL","Day 1 - 3rd Heaviest Bass Total",50,"ROYALL, Tony "]
[39,"NORTH NORFOLK BASS FESTIVAL","Day 1 - 2nd Heaviest Bass Total",70,"ROGERS, Mark"]
[40,"NORTH NORFOLK BASS FESTIVAL","Day 1 - 1st Heaviest Bass Total",100,"WALES, Joe"]
[41,"NORTH NORFOLK BASS FESTIVAL","Day 1 - 4th Heaviest All Fish Total",30,"ROYALL, Tony "]
[42,"NORTH NORFOLK BASS FESTIVAL","Day 1 - 3rd Heaviest All Fish Total",50,"ROGERS, Mark"]
[43,"NORTH NORFOLK BASS FESTIVAL","Day 1 - 2nd Heaviest All Fish Total",70,"BOND, Darren"]
[44,"NORTH NORFOLK BASS FESTIVAL","Day 1 - 1st Heaviest All Fish Total",100,"WALES, Joe"]
[45,"NORTH NORFOLK BASS FESTIVAL","Day 1 - 4th Heaviest Flattie Total",30,"GOOCH, Mark"]
[46,"NORTH NORFOLK BASS FESTIVAL","Day 1 - 3rd Heaviest Flattie Total",50,"DRAYTON, Simon"]
[47,"NORTH NORFOLK BASS FESTIVAL","Day 1 - 2nd Heaviest FlattieTotal",70,"WALES, Joe"]
[48,"NORTH NORFOLK BASS FESTIVAL","Day 1 -1st Heaviest Flattie Total",100,"CROSBY, Colin"]
[49,"NORTH NORFOLK BASS FESTIVAL","Day 1 - 3rd Heaviest Flat Fish=",15,"GARDINER, Gareth"]
[50,"NORTH NORFOLK BASS FESTIVAL","Day 1 - 3rd Heaviest Flat Fish=",15,"WALES, Joe"]
[51,"NORTH NORFOLK BASS FESTIVAL","Day 1 - Ist Heaviest Flat Fish=",50,"JOHNSON, Billy"]
[52,"NORTH NORFOLK BASS FESTIVAL","Day 1 - Ist Heaviest Flat Fish=",50,"CROSBY, Colin"]
[53,"NORTH NORFOLK BASS FESTIVAL","Day 1 - 3rd Heaviest Bass=",15,"SMITH, George"]
[54,"NORTH NORFOLK BASS FESTIVAL","Day 1 - 3rd Heaviest Bass=",15,"DOY, Alan"]
[55,"NORTH NORFOLK BASS FESTIVAL","Day 1 - 2nd Heaviest Bass",40,"ROPER, Liam"]
[56,"NORTH NORFOLK BASS FESTIVAL","Day 1 - 1st Heaviest Bass",60,"ROYALL, Tony "]
[57,"NORTH NORFOLK BASS FESTIVAL","Day 2 - 3rd Zone A Optional Pools",30,"CROSBY, Ralf"]
[58,"NORTH NORFOLK BASS FESTIVAL","Day 2 - 2nd Zone A Optional Pools",40,"SHORTHOUSE, Dave"]
[59,"NORTH NORFOLK BASS FESTIVAL","Day 2 - 1st Zone A Optional Pools",70,"GARDINER, Gareth"]
[60,"NORTH NORFOLK BASS FESTIVAL","Day 2 - 3rd Zone B Optional Pools",30,"NANGLE, Karl"]
[61,"NORTH NORFOLK BASS FESTIVAL","Day 2 - 2nd Zone B Optional Pools",40,"FALK, Dave"]
[62,"NORTH NORFOLK BASS FESTIVAL","Day 2 - 1st Zone B Optional Pools",70,"ADAMS, Graham"]
[63,"NORTH NORFOLK BASS FESTIVAL","Day 2 - 3rd Zone C Optional Pools",30,"CUTLER, Neil"]
[64,"NORTH NORFOLK BASS FESTIVAL","Day 2 - 2nd Zone C Optional Pools",40,"TURNER, Cameron"]
[65,"NORTH NORFOLK BASS FESTIVAL","Day 2 - 1st Zone C Optional Pools",70,"PRICE, Ben"]
[66,"NORTH NORFOLK BASS FESTIVAL","Day 2 - 3rd Zone D Optional Pools",30,"RUSSELL, Shane"]
[67,"NORTH NORFOLK BASS FESTIVAL","Day 2 - 2nd Zone D Optional Pools",40,"MOORING, Luke"]
[68,"NORTH NORFOLK BASS FESTIVAL","Day 2 - 1st Zone D Optional Pools",70,"ADAMS, Stephen"]
[69,"NORTH NORFOLK BASS FESTIVAL","Day 2 - 3rd Zone E Optional Pools",30,"DIAPER, Barry"]
[70,"NORTH NORFOLK BASS FESTIVAL","Day 2 - 2nd Zone E Optional Pools",40,"PAGE, Saul"]
[71,"NORTH NORFOLK BASS FESTIVAL","Day 2 - 1st Zone E Optional Pools",70,"TUCK, Rob"]
[72,"NORTH NORFOLK BASS FESTIVAL","Day 2 - 3rd Zone F Optional Pools",30,"BURT, Richard"]
[73,"NORTH NORFOLK BASS FESTIVAL","Day 2 - 2nd Zone F Optional Pools",40,"GOOCH, Mark"]
[74,"NORTH NORFOLK BASS FESTIVAL","Day 2 - 1st Zone F Optional Pools",70,"LINDFIELD, Bill"]
[75,"NORTH NORFOLK BASS FESTIVAL","Day 2 - 3rd Zone G Optional Pools",30,"YALLOP, Stephen"]
[76,"NORTH NORFOLK BASS FESTIVAL","Day 2 - 2nd Zone G Optional Pools",40,"WATTS, Mike"]
[77,"NORTH NORFOLK BASS FESTIVAL","Day 2 - 1st Zone G Optional Pools",70,"ROGERS, Mark"]
[78,"NORTH NORFOLK BASS FESTIVAL","Day 2 - 3rd Zone H Optional Pools",30,"CROSBY, Colin"]
[79,"NORTH NORFOLK BASS FESTIVAL","Day 2 - 2nd Zone H Optional Pools",40,"SMITH, George"]
[80,"NORTH NORFOLK BASS FESTIVAL","Day 2 - 1st Zone H Optional Pools",70,"BOND, Darren"]
[81,"NORTH NORFOLK JUNIORS TOURNAMENT","Day 2 - Winner","Holt SAC £25 prize","BANHAM, Mark"]
[82,"UK LADIES CHAMPIONSHIPS","Day 2 - Third Place",25,"LEE, Louise"]
[83,"UK LADIES CHAMPIONSHIPS","Day 2 - Runner Up",35,"LINDFIELD, Heather"]
[84,"UK LADIES CHAMPIONSHIPS","Day 2 - Winner",60,"WICKS, Maralyn"]
[85,"NORTH NORFOLK BASS FESTIVAL","Day 2 - 1st Zone A",10,"GARDINER, Gareth"]
[86,"NORTH NORFOLK BASS FESTIVAL","Day 2 - 1st Zone B",10,"ADAMS, Graham"]
[87,"NORTH NORFOLK BASS FESTIVAL","Day 2 - 1st Zone C",10,"PRICE, Ben"]
[88,"NORTH NORFOLK BASS FESTIVAL","Day 2 - 1st Zone D",10,"ADAMS, Stephen"]
[89,"NORTH NORFOLK BASS FESTIVAL","Day 2 - 1st Zone E",10,"TUCK, Rob"]
[90,"NORTH NORFOLK BASS FESTIVAL","Day 2 - 1st Zone F",10,"LINDFIELD, Bill"]
[{"$f":"1+A91","v":91},"NORTH NORFOLK BASS FESTIVAL","Day 2 - 1st Zone G",10,"ROGERS, Mark"]
[92,"NORTH NORFOLK BASS FESTIVAL","Day 2 - 1st Zone H",10,"BOND, Darren"]
[93,"NORTH NORFOLK BASS FESTIVAL","Day 2 - 4th Heaviest Bass Total",30,"WRIGHT, Dave"]
[94,"NORTH NORFOLK BASS FESTIVAL","Day 2 - 3rd Heaviest Bass Total",50,"WOOD, Gary"]
[95,"NORTH NORFOLK BASS FESTIVAL","Day 2 - 2nd Heaviest Bass Total",70,"McCOY, Kenny"]
[96,"NORTH NORFOLK BASS FESTIVAL","Day 2 - 1st Heaviest Bass Total",100,"TAYLOR, Mark"]
[97,"NORTH NORFOLK BASS FESTIVAL","Day 2 - 4th Heaviest All Fish Total",30,"BOND, Darren"]
[98,"NORTH NORFOLK BASS FESTIVAL","Day 2 - 3rd Heaviest All Fish Total",50,"ADAMS, Graham"]
[99,"NORTH NORFOLK BASS FESTIVAL","Day 2 - 2nd Heaviest All Fish Total",70,"GARDINER, Gareth"]
[100,"NORTH NORFOLK BASS FESTIVAL","Day 2 - 1st Heaviest All Fish Total",100,"TUCK, Rob"]
[101,"NORTH NORFOLK BASS FESTIVAL","Day 2 - 4th Heaviest Flattie Total",30,"BOND, Darren"]
[102,"NORTH NORFOLK BASS FESTIVAL","Day 2 - 3rd Heaviest Flattie Total",50,"GALLACHER, Andy"]
[103,"NORTH NORFOLK BASS FESTIVAL","Day 2 - 2nd Heaviest Flattie Total",70,"GOOCH, Mark"]
[104,"NORTH NORFOLK BASS FESTIVAL","Day 2 - 1st Heaviest Flattie Total",100,"ROGERS, Mark"]
[105,"NORTH NORFOLK BASS FESTIVAL","Day 2 - 3rd Heaviest Flat Fish",30,"CROSBY, Ralf"]
[106,"NORTH NORFOLK BASS FESTIVAL","Day 2 - 1st Heaviest Flat Fish =",50,"TUCK, Rob"]
[107,"NORTH NORFOLK BASS FESTIVAL","Day 2 - 1st Heaviest Flat Fish =",50,"COOPER, Sam"]
[108,"NORTH NORFOLK BASS FESTIVAL","Day 2 - 3rd Heaviest Bass",30,"TAYLOR, Mark"]
[109,"NORTH NORFOLK BASS FESTIVAL","Day 2 - 2nd Heaviest Bass",40,"WOOD, Gary"]
[110,"NORTH NORFOLK BASS FESTIVAL","Day 2 - 1st Heaviest Bass",60,"McCOY, Kenny"]
[111,"NORTH NORFOLK BASS FESTIVAL EVENT","Overall Heaviest Festival Catch ",50,"TUCK, Rob"]
[112,"NORTH NORFOLK BASS FESTIVAL EVENT","Overall Heaviest Festival Fish",50,"GARDINER, Gareth"]
[113,"NORTH NORFOLK BASS FESTIVAL EVENT","Heaviest Festival Bass","Kelling Heath Short Break Holiday","ROYALL, Tony "]
[114,"NORTH NORFOLK JUNIORS TOURNAMENT","Overall Junior Third Place","Holt SAC £20 Prize plus Breakaway Goodies Bag ","ALDOUS, Brayden"]
[115,"NORTH NORFOLK JUNIORS TOURNAMENT","Overall Junior Runner Up","Holt SAC £30 Price plus Breakaway Goodies Bag","BANHAM, Mark"]
[116,"NORTH NORFOLK JUNIORS TOURNAMENT","Overall Festival Junior Champion","Country Cars Perpetual Shield plus Holt SAC £50 Prize & Breakaway Goodies Bag","TOPPING, Jack"]
[117,"UK LADIES CHAMPIONSHIPS","Overall Ladies Eighth Place","TronixPro Lead Bag","HILLS, Amy"]
[118,"UK LADIES CHAMPIONSHIPS","Overall Ladies Seventh Place","TronixPro Lead Bag","HANCOX, Karen"]
[119,"UK LADIES CHAMPIONSHIPS","Overall Ladies Sixth Place","TronixPro Lead Bag","FRARY, June"]
[120,"UK LADIES CHAMPIONSHIPS","Overall Ladies Fifth Place","TronixPro Lead Bag","LEE, Louise"]
[121,"UK LADIES CHAMPIONSHIPS","Overall Ladies Fourth Place","TronixPro Lead Bag","METCALFE, Wendy"]
[122,"UK LADIES CHAMPIONSHIPS","Overall Ladies Third Place","TronixPro Lead Bag","BROWN, Kay"]
[123,"UK LADIES CHAMPIONSHIPS","Overall Ladies Runner Up","TronixPro Reel & TronixPro Lead Bag","LINDFIELD, Heather"]
[124,"UK LADIES CHAMPIONSHIPS","Overall Festival Ladies Champion","TronixPro Perpetual Shield plus TonixPro Rod & TronixPro Lead Bag","WICKS, Maralyn"]
[125,"SHANNOCK QUADS","Overall Fourth Place Team",50,"SHEEP SHAGGERS (PRICE, Ben)"]
[126,"SHANNOCK QUADS","Overall Third Place Team",60,"ANYFISH ANYWHERE ASSO (SMITH, George)"]
[127,"SHANNOCK QUADS","Overall Runners Up Team",70,"THE MAGGOTS      (BOND, Darren)"]
[128,"SHANNOCK QUADS","Overall Champion Team","£120 plus Sheringham Carnival Perpetual Shield","TEAM BREAKAWAY (ADAMS, Stephen)"]
[129,"MYSTERY PAIRS","Overall Sixth Place Pair (Share £40)",20,"ROGERS, Mark"]
[130,"MYSTERY PAIRS","Overall Sixth Place Pair (Share £40)",20,"DAWBER, Simon"]
[131,"MYSTERY PAIRS","Overall Fifth Place Pair (Share £40)",20,"CROSBY, Ralf"]
[132,"MYSTERY PAIRS","Overall Fifth Place Pair (Share £40)",20,"HUTSON, Garry"]
[133,"MYSTERY PAIRS","Overall Fourth Place Pair (Share£60)",30,"GOOCH, Mark"]
[134,"MYSTERY PAIRS","Overall Fourth Place Pair (Share£60)",30,"GASCOIGNE, Robert"]
[135,"MYSTERY PAIRS","Overall Third Place Pair (Share £80)",40,"LAY-FLURRIE, Matt"]
[136,"MYSTERY PAIRS","Overall Third Place Pair (Share £80)",40,"PRICE, Ben"]
[137,"MYSTERY PAIRS","Overall Runner Up Pair (Share £100)",50,"BURT, Richard"]
[138,"MYSTERY PAIRS","Overall Runner Up Pair (Share £100)",50,"ADAMS, Graham"]
[139,"MYSTERY PAIRS","Overall Festival Champion Pair (Share £200)",100,"GARDINER, Gareth"]
[140,"MYSTERY PAIRS","Overall Festival Champion Pair (Share £200)",100,"DIAPER, Barry"]
[141,"NORTH NORFOLK BASS FESTIVAL EVENT","Overall Fifth Place",80,"GARDINER, Gareth"]
[142,"NORTH NORFOLK BASS FESTIVAL EVENT","Overall Fourth Place",100,"FALK, Dave"]
[143,"NORTH NORFOLK BASS FESTIVAL EVENT","Overall Third Place",200,"ROGERS, Mark"]
[144,"NORTH NORFOLK BASS FESTIVAL EVENT","Overall Runner Up",350,"BOND, Darren"]
[145,"NORTH NORFOLK BASS FESTIVAL EVENT","Overall Festival Champion","£500 plus Kelling Heath Perpetual Shield","TUCK, Rob"]
[null,null,"TOTAL",6960]

{"sheet":"Nth Nfk Bass Fest. (ALL)","index":4,"n_rows":123,"n_cols":6,"rows_kept":123,"cut":false,"hidden":false,"merged":[[1,5,2,5],[0,1,0,5],[1,0,2,0],[1,1,2,1],[1,2,2,2],[1,3,2,3],[1,4,2,4]]}
["NORTH NORFOLK BASS FESTIVAL 2020-21","Overall - Final Positions"]
["Angler Name","Total No. Fish Points","Day 1 Points","Day 2 Points","Total Points","Overall Position"]
[{"$error":"#N/A"}]
["TUCK, Rob",1025,1,1,1.897464,1]
["BOND, Darren",1022,1,1,1.897726,2]
["ROGERS, Mark",878,1,1,1.912134,3]
["FALK, Dave",765,1,2,2.9234440000000004,4]
["GARDINER, Gareth",997,3,1,3.9002620000000001,5]
["SMITH, George",882,2,2,3.9117380000000002,6]
["CROSBY, Ralf",808,1,3,3.919152,7]
["GOOCH, Mark",678,2,2,3.93215,8]
["RUSSELL, Shane",678,1,3,3.9321739999999998,9]
["BURT, Richard",760,2,3,4.9239459999999999,10]
["NANGLE, Karl",656,2,3,4.9343630000000003,11]
["SHORTHOUSE, Dave",748,4,2,5.9251580000000006,12]
["ADAMS, Stephen",740,5,1,5.9259750000000002,13]
["MOORING, Luke",624,4,2,5.9375619999999998,14]
["CROSBY, Colin",736,4,3,6.9263479999999999,15]
["PAGE, Saul",484,5,2,6.9515560000000001,16]
["McCOY, Kenny",459,3,4,6.9540730000000002,17]
["LAY-FLURRIE, Matt",458,3,5,7.954167,18]
["ARCH, Joe",426,4,4,7.9573599999999995,19]
["DENHOLM, Paul",360,2,6,7.9639720000000001,20]
["TAYLOR, Mark",625,5,4,8.9374669999999998,21]
["TURNER, Cameron",536,7,2,8.946371000000001,22]
["ELLIOTT, Nathan",513,4,5,8.9486629999999998,23]
["RYDER, Edde",375,3,6,8.9624790000000001,24]
["DOY, Alan",362,2,7,8.9637840000000004,25]
["PERRY, Joe",617,6,4,9.9382590000000004,26]
["BUY, Craig",546,4,6,9.9453610000000001,27]
["WATTS, Mike",519,8,2,9.9480500000000003,28]
["FRENCH, Julian",481,3,7,9.9518599999999999,29]
["PRICE, Ben",560,10,1,10.943975,30]
["PINDER, Mark",526,7,4,10.947376,31]
["ROYALL, Tony ",512,1,10,10.948772,32]
["THORPE, Doug",508,6,5,10.949154999999999,33]
["CUTLER, Neil",466,8,3,10.953369,34]
["WALES, Joe",620,1,11,11.937968000000001,35]
["LEE, Martin",522,4,8,11.947771000000001,36]
["SERBAN, Nelu",388,6,6,11.961171999999999,37]
["McGILLOWAY, Wayne",548,6,7,12.945161000000001,38]
["LINDFIELD, Bill",521,12,1,12.947858,39]
["PLUMSTEAD, Joe",505,3,10,12.949458,40]
["SPALL, Chris",471,6,7,12.952855999999999,41]
["FRARY, Charlie",353,7,6,12.964671000000001,42]
["DIAPER, Barry",311,10,3,12.968874,43]
["COTTER, Brett",283,6,7,12.971685000000001,44]
["ADAMS, Graham",646,13,1,13.935361,45]
["WELLS, Thomas",388,5,9,13.961173,46]
["PRICE, Alan",381,10,4,13.961885000000001,47]
["CLEMENT, Alby",333,9,5,13.966666999999999,48]
["GALLACHER, Andy",537,11,4,14.946247000000001,49]
["EDWARDS, Lee",436,4,11,14.956368000000001,50]
["LEE, Phil",251,7,8,14.974876,51]
["DRAYTON, Simon",429,3,13,15.957064000000001,52]
["GASCOIGNE, Robert",402,10,6,15.959769,53]
["PROVINS, Colin",386,7,9,15.961366,54]
["GREEN, Kevin",360,7,9,15.963975,55]
["PRICE, Jimmy",358,6,10,15.964174,56]
["ROBERTS, Steve",340,5,11,15.965980999999999,57]
["AKESTER, Jack",298,11,5,15.970168000000001,58]
["SMITH, Stephen",275,8,8,15.972480000000001,59]
["HUTSON, Garry",418,9,8,16.958163000000003,60]
["TOPPING, Mike",361,7,10,16.96387,61]
["HIPPERSON, Richard",359,10,7,16.964070999999997,62]
["BORDIANU, Adrian",299,11,6,16.970078999999998,63]
["CARTER, John",271,5,12,16.972874999999998,64]
["HUTCHINSON, Dave",339,5,13,17.966069000000001,65]
["ROPER, Liam",182,2,16,17.981794999999998,66]
["HARRISON, Paul",346,11,8,18.965377999999998,67]
["STEBBINGS, Robert",342,12,7,18.965773000000002,68]
["SELF, Bevan",322,14,5,18.967777000000002,69]
["BOWELL, Ian",310,8,11,18.968969000000001,70]
["THORNTON, Lee",307,11,8,18.969273000000001,71]
["COOPER, Phillip",295,7,12,18.970477000000002,72]
["COOPER, Sam",277,15,4,18.972279,73]
["NELSON, Ian",268,12,7,18.973181999999998,74]
["LINDFIELD, Heather",225,10,9,18.977477999999998,75]
["BROWN, Kay",204,9,10,18.979583000000002,76]
["BALL, Keith",386,15,5,19.961373000000002,77]
["BANHAM, Jason",340,11,9,19.965972000000001,78]
["DAWBER, Simon",208,10,10,19.979182999999999,79]
["THOMAS, Tony",166,8,12,19.98339,80]
["ALDOUS, David",212,6,15,20.97878,81]
["KINGDON, Adam",184,13,8,20.981589,82]
["PARKER, Daniel",174,8,13,20.982587000000002,83]
["PEMBERTON, Andy",305,10,12,21.969474999999999,84]
["NICHOLSON, Steven",263,8,14,21.973687000000002,85]
["AUSTIN, John",210,13,9,21.978987,86]
["HAZELGROVE, Gary",199,11,11,21.980084000000002,87]
["LAMBERT, Ian",98,9,13,21.990196000000001,88]
["PARKER, Gavin",80,11,11,21.991993000000001,89]
["TOPPING, Jack",269,9,14,22.973078999999998,90]
["BANCROFT, Dave",137,8,15,22.986287000000001,91]
["CREASEY, Shaun",128,13,10,22.987197000000002,92]
["PEARCE, Vic",283,12,12,23.971677,93]
["LILL, Jarrod",202,16,8,23.979782,94]
["METCALFE, Wendy",168,13,11,23.983186,95]
["KNIGHT, Simon",149,9,15,23.985087999999998,96]
["BOTEZATO, Constantin",130,12,12,23.986986999999999,97]
["SMITH, Leon",319,16,9,24.968070000000001,98]
["HADDOCK, Roy",127,11,14,24.987287000000002,99]
["STORER, Paul",115,16,9,24.988491,100]
["KIMBLE, John",260,16,11,26.973980000000001,101]
["SMART, Neil",250,14,13,26.974978,102]
["JOHNSON, Billy",187,13,14,26.981284000000002,103]
["HIGHFIELD, Nik",173,14,13,26.982685,104]
["DIAPER, Greg",165,14,13,26.983484999999998,105]
["HARVEY, Paul ",42,15,12,26.995795999999999,106]
["PARKER, Al",39,13,14,26.996096999999999,107]
["MARTLAND, Kev",240,14,14,27.97598,108]
["FRARY, June",141,16,12,27.985884000000002,109]
["BANHAM, Mark",167,13,16,28.98329,110]
["HANCOX, Karen",137,16,13,28.986283,111]
["BETTINSON, Charles",113,15,14,28.988686000000001,112]
["LEE, Louise",179,16,15,30.982087999999997,113]
["HENNEY, Jimmy",106,16,15,30.98939,114]
["ALDOUS, Brayden",89,15,16,30.991092999999999,115]
["BROCK, Peter",0,16,16,32,116]
["GIBBS, Tom (DID NOT FISH)",0,16,16,32,116]
["HILLS, Amy",0,16,16,32,116]
["HURCOMBE, Mark",0,16,16,32,116]
["MURRAY, Luke (DID NOT FISH)",0,16,16,32,116]

{"sheet":"Overall Heaviest Bass","index":5,"n_rows":153,"n_cols":10,"rows_kept":153,"cut":false,"hidden":false,"merged":[[0,2,0,4],[0,5,0,9],[1,9,2,9],[1,0,2,0],[1,1,2,1],[1,2,2,2],[1,3,2,3],[1,4,2,4],[1,5,2,5],[1,8,2,8]]}
[null,null,"NORTH NORFOLK BASS FESTIVAL 2020-21",null,null,"Overall Heaviest Bass"]
["Overall Number","Individual No.","Angler Name","Angler No.","Peg","Fish Points","Weight",null,"Day","Position"]
[null,null,null,null,null,null,"lbs","oz"]
[1,1,"ROYALL, Tony ","97-1",123,158,3,4.666666666666667,"Day 1",1]
[2,2,"ROPER, Liam","96-1",107,129,2,11,"Day 1",2]
[3,3,"McCOY, Kenny","74-2",81,122,2,8.6666666666666661,"Day 2",3]
[4,4,"SMITH, George","104-1",55,116,2,6.666666666666667,"Day 1",4]
[5,5,"DOY, Alan","35-1",95,116,2,6.666666666666667,"Day 1",4]
[6,6,"WOOD, Gary","124-2",31,116,2,6.666666666666667,"Day 2",4]
[7,7,"Unused Pegs 2","128-1",1,110,2,4.666666666666667,"Day 1",7]
[8,8,"WALES, Joe","118-1",4,110,2,4.666666666666667,"Day 1",7]
[9,9,"RUSSELL, Shane","98-1",72,110,2,4.666666666666667,"Day 1",7]
[10,10,"YALLOP, Oliver","125-1",3,104,2,2.6666666666666665,"Day 1",10]
[11,11,"ROGERS, Mark","95-1",21,104,2,2.6666666666666665,"Day 1",10]
[12,12,"BOND, Darren","13-1",63,104,2,2.6666666666666665,"Day 1",10]
[13,13,"TAYLOR, Mark","110-2",8,104,2,2.6666666666666665,"Day 2",10]
[14,14,"McGILLOWAY, Wayne","75-1",6,98,2,0.66666666666666663,"Day 1",14]
[15,15,"LEE, Martin","68-1",120,98,2,0.66666666666666663,"Day 1",14]
[16,16,"CROSBY, Ralf","29-1",86,92,1,14.666666666666666,"Day 1",16]
[17,17,"WRIGHT, Dave","123-1",113,92,1,14.666666666666666,"Day 1",16]
[18,18,"WRIGHT, Dave","123-2",27,80,1,10.666666666666666,"Day 2",18]
[19,19,"NANGLE, Karl","78-2",18,74,1,8.6666666666666661,"Day 2",19]
[20,20,"BURT, Richard","20-1",16,68,1,6.666666666666667,"Day 1",20]
[21,21,"SERBAN, Nelu","101-1",50,68,1,6.666666666666667,"Day 1",20]
[22,22,"LAMBERT, Ian","65-1",67,68,1,6.666666666666667,"Day 1",20]
[23,23,"ADAMS, Stephen","2-1",128,68,1,6.666666666666667,"Day 1",20]
[24,24,"WELLS, Thomas","120-1",52,63,1,5,"Day 1",24]
[25,25,"WICKS, Maralyn","122-1",112,55,1,2.3333333333333335,"Day 1",25]
[26,26,"TOPPING, Jack","114-1",13,51,1,1,"Day 1",26]
[27,27,"BUY, Craig","21-1",49,51,1,1,"Day 1",26]
[28,28,"NELSON, Ian","79-1",73,51,1,1,"Day 1",26]
[29,29,"LAY-FLURRIE, Matt","66-1",12,47,0,15.666666666666666,"Day 1",29]
[30,30,"RYDER, Edde","99-1",87,47,0,15.666666666666666,"Day 1",29]
[31,31,"GARDINER, Gareth","44-2",1,47,0,15.666666666666666,"Day 2",29]
[32,32,"GOOCH, Mark","47-1",18,43,0,14.333333333333334,"Day 1",32]
[33,33,"GREEN, Kevin","48-1",122,40,0,13.333333333333334,"Day 1",33]
[34,34,"DENHOLM, Paul","32-1",38,37,0,12.333333333333334,"Day 1",34]
[35,35,"FRENCH, Julian","42-2",24,16,0,5.333333333333333,"Day 2",35]
[36,36,"SELF, Bevan","100-2",33,16,0,5.333333333333333,"Day 2",35]
[37,37,"","","","","","","",""]
[38,38,"","","","","","","",""]
[39,39,"","","","","","","",""]
[40,40,"","","","","","","",""]
[41,41,"","","","","","","",""]
[42,42,"","","","","","","",""]
[43,43,"","","","","","","",""]
[44,44,"","","","","","","",""]
[45,45,"","","","","","","",""]
[46,46,"","","","","","","",""]
[47,47,"","","","","","","",""]
[48,48,"","","","","","","",""]
[49,49,"","","","","","","",""]
[50,50,"","","","","","","",""]
[51,51,"","","","","","","",""]
[52,52,"","","","","","","",""]
[53,53,"","","","","","","",""]
[54,54,"","","","","","","",""]
[55,55,"","","","","","","",""]
[56,56,"","","","","","","",""]
[57,57,"","","","","","","",""]
[58,58,"","","","","","","",""]
[59,59,"","","","","","","",""]
[60,60,"","","","","","","",""]
[61,61,"","","","","","","",""]
[62,62,"","","","","","","",""]
[63,63,"","","","","","","",""]
[64,64,"","","","","","","",""]
[65,65,"","","","","","","",""]
[66,66,"","","","","","","",""]
[67,67,"","","","","","","",""]
[68,68,"","","","","","","",""]
[69,69,"","","","","","","",""]
[70,70,"","","","","","","",""]
[71,71,"","","","","","","",""]
[72,72,"","","","","","","",""]
[73,73,"","","","","","","",""]
[74,74,"","","","","","","",""]
[75,75,"","","","","","","",""]
[76,76,"","","","","","","",""]
[77,77,"","","","","","","",""]
[78,78,"","","","","","","",""]
[79,79,"","","","","","","",""]
[80,80,"","","","","","","",""]
[81,81,"","","","","","","",""]
[82,82,"","","","","","","",""]
[83,83,"","","","","","","",""]
[84,84,"","","","","","","",""]
[85,85,"","","","","","","",""]
[86,86,"","","","","","","",""]
[87,87,"","","","","","","",""]
[88,88,"","","","","","","",""]
[89,89,"","","","","","","",""]
[90,90,"","","","","","","",""]
[91,91,"","","","","","","",""]
[92,92,"","","","","","","",""]
[93,93,"","","","","","","",""]
[94,94,"","","","","","","",""]
[95,95,"","","","","","","",""]
[96,96,"","","","","","","",""]
[97,97,"","","","","","","",""]
[98,98,"","","","","","","",""]
[99,99,"","","","","","","",""]
[100,100,"","","","","","","",""]
[101,101,"","","","","","","",""]
[102,102,"","","","","","","",""]
[103,103,"","","","","","","",""]
[104,104,"","","","","","","",""]
[105,105,"","","","","","","",""]
[106,106,"","","","","","","",""]
[107,107,"","","","","","","",""]
[108,108,"","","","","","","",""]
[109,109,"","","","","","","",""]
[110,110,"","","","","","","",""]
[111,111,"","","","","","","",""]
[112,112,"","","","","","","",""]
[113,113,"","","","","","","",""]
[114,114,"","","","","","","",""]
[115,115,"","","","","","","",""]
[116,116,"","","","","","","",""]
[117,117,"","","","","","","",""]
[118,118,"","","","","","","",""]
[119,119,"","","","","","","",""]
[120,120,"","","","","","","",""]
[121,121,"","","","","","","",""]
[122,122,"","","","","","","",""]
[123,123,"","","","","","","",""]
[124,124,"","","","","","","",""]
[125,125,"","","","","","","",""]
[126,126,"","","","","","","",""]
[127,127,"","","","","","","",""]
[128,128,"","","","","","","",""]
[129,129,"","","","","","","",""]
[130,130,"","","","","","","",""]
[131,131,"","","","","","","",""]
[132,132,"","","","","","","",""]
[133,133,"","","","","","","",""]
[134,134,"","","","","","","",""]
[135,135,"","","","","","","",""]
[136,136,"","","","","","","",""]
[137,137,"","","","","","","",""]
[138,138,"","","","","","","",""]
[139,139,"","","","","","","",""]
[140,140,"","","","","","","",""]
[141,141,"","","","","","","",""]
[142,142,"","","","","","","",""]
[143,143,"","","","","","","",""]
[144,144,"","","","","","","",""]
[145,145,"","","","","","","",""]
[146,146,"","","","","","","",""]
[147,147,"","","","","","","",""]
[148,148,"","","","","","","",""]
[149,149,"","","","","","","",""]
[150,150,"","","","","","","",""]

{"sheet":"Ladies Champs. Ind. result","index":6,"n_rows":11,"n_cols":9,"rows_kept":11,"cut":false,"hidden":false,"merged":[[1,8,2,8],[0,1,0,3],[0,4,0,8],[1,0,2,0],[1,1,2,1],[1,2,2,2],[1,3,2,3],[1,4,2,4],[1,5,2,5],[1,6,2,6],[1,7,2,7]]}
[null,"UK LADIES CHAMPIONSHIPS 2020-21",null,null,"Overall - Final Positions"]
["Overall Number","Angler Name","Angler No","Total No. Fish","Total No. Fish Points","Day 1 Points","Day 2 Points","Total Points","Overall Position"]
[null,{"$error":"#N/A"}]
[1,"WICKS, Maralyn",122,20,325,1.0000166611129624,1.0000037710234557,1.9675004321364185,1]
[2,"LINDFIELD, Heather",72,22,225,3.00003223726628,2.0000051493305868,4.9775153865968669,2]
[3,"BROWN, Kay",18,17,204,2.0000227221086115,4.0000062437562436,5.979611965864855,3]
[4,"METCALFE, Wendy",19,14,168,4.0000768639508069,5.0000064462064078,8.9832693101572154,4]
[5,"LEE, Louise",67,12,179,8,3.0000055828494863,10.982093582849487,5]
[6,"FRARY, June",41,16,141,8,6.0000070841598188,13.985891084159819,6]
[7,"HANCOX, Karen",50,17,137,8,7.0000072902238095,14.98629029022381,7]
[8,"HILLS, Amy",56,0,0,8,8,32,8]

{"sheet":"Juniors Ind. result","index":7,"n_rows":6,"n_cols":9,"rows_kept":6,"cut":false,"hidden":false,"merged":[[1,0,2,0],[1,1,2,1],[1,2,2,2],[1,3,2,3],[1,4,2,4],[0,1,0,3],[0,4,0,8],[1,5,2,5],[1,6,2,6],[1,7,2,7],[1,8,2,8]]}
[null,"NORTH NORFOLK JUNIORS TOURNAMENT 2020-21",null,null,"Overall - Final Positions"]
["Overall Number","Angler Name","Angler No","Total No. Fish","Total No. Fish Points","Day 1 Points","Day 2 Points","Total Points","Overall Position"]
[null,{"$error":"#N/A"}]
[1,"TOPPING, Jack",114,21,269,1,2,2.9730790000000002,1]
[2,"BANHAM, Mark",11,10,167,2,1,2.9832899999999998,2]
[3,"ALDOUS, Brayden",4,7,89,3,3,5.9910930000000002,3]

{"sheet":"Shannock Quads Overall","index":8,"n_rows":16,"n_cols":8,"rows_kept":16,"cut":false,"hidden":false,"merged":[[0,1,0,3],[0,4,0,7],[1,5,2,5],[1,0,2,0],[1,1,2,1],[1,2,2,2],[1,3,2,3],[1,4,2,4]]}
[null,"SHANNOCK QUADS 2020-21",null,null,"Overall (Teams)"]
["Team Count","Overall Position","Team No.","Team Name","No. Fish","Fish Points","Weight"]
[null,null,null,null,null,null,"lbs","oz"]
[1,1,1,"TEAM BREAKAWAY",154,3071,63,15.666666666666666]
[2,2,4,"THE MAGGOTS",192,2662,55,7.333333333333333]
[3,3,10,"ANYFISH ANYWHERE ASSO",172,2385,49,11]
[4,4,7,"SHEEP SHAGERS",130,2212,46,1.3333333333333333]
[5,5,12,"NORTH NORFOLK LADS",118,1767,36,13]
[6,6,2,"TIDLER SQUAD",107,1548,32,4]
[7,7,5,"SAUL & CO",112,1467,30,9]
[8,8,6,"PRICEY'S GUYS & GAL",90,1362,28,6]
[9,9,9,"IPSWICH SEA ANGLERS",105,1359,28,5]
[10,10,11,"BENNET ROOFING",105,1300,27,1.3333333333333333]
[11,11,13,"GORLESTON TACKLE",91,1295,26,15.666666666666666]
[12,12,3,"TEAM BIRDS",86,1147,23,14.333333333333334]
[13,13,8,"VETERANS + 1",74,1070,22,4.666666666666667]

{"sheet":"Mystery Pairs Overall","index":9,"n_rows":62,"n_cols":9,"rows_kept":62,"cut":false,"hidden":false,"merged":[[1,5,2,5],[1,8,2,8],[0,0,0,1],[0,2,0,8],[1,0,2,0],[1,1,2,1],[1,2,2,2],[1,3,2,3],[1,4,2,4]]}
["BASS FESTIVAL MYSTERY PAIRS          2020-21",null,"Overall (Pairs)"]
["Overall Position","Team Name","Day 1 Zone Points","Day 2 Zone Points","Total No. Fish","Total Fish Points","Total Weight",null,"Total Zone Points"]
[null,null,null,null,null,null,"lbs","oz"]
[1,"GARDINER, Gareth & DIAPER, Barry",13,4,51,1308,27,4,16.986869000000002]
[2,"BURT, Richard & ADAMS, Graham",15,4,72,1406,29,4.666666666666667,18.985868]
[3,"LAY-FLURRIE, Matt & PRICE, Ben",13,6,74,1018,21,3.3333333333333335,18.989746]
[4,"GOOCH, Mark & GASCOIGNE, Robert",12,8,76,1080,22,8,19.989124]
[5,"CROSBY, Ralf & HUTSON, Garry",10,11,58,1226,25,8.6666666666666661,20.987682]
[6,"ROGERS, Mark & DAWBER, Simon",11,11,56,1086,22,10,21.989083999999998]
[7,"TURNER, Cameron & LINDFIELD, Bill",19,3,67,1057,22,0.33333333333333331,21.989362999999997]
[8,"SHORTHOUSE, Dave & AKESTER, Jack",15,7,58,1046,21,12.666666666666666,21.989482000000002]
[9,"ARCH, Joe & CLEMENT, Alby",13,9,50,759,15,13,21.992359999999998]
[10,"BOND, Darren & HAZELGROVE, Gary",12,12,48,1221,25,7,23.987742000000001]
[11,"TUCK, Rob & KNIGHT, Simon",10,16,27,1174,24,7.333333333333333,25.988233000000001]
[12,"CROSBY, Colin & COOPER, Sam",19,7,46,1013,21,1.6666666666666667,25.989823999999999]
[13,"TAYLOR, Mark & HARRISON, Paul",16,12,49,971,20,3.6666666666666665,27.990241000000001]
[14,"ADAMS, Stephen & PARKER, Gavin",16,12,63,820,17,1.3333333333333333,27.991737000000001]
[15,"NANGLE, Karl & CREASEY, Shaun",15,13,28,784,16,5.333333333333333,27.992131999999998]
[16,"PERRY, Joe & WICKS, Maralyn",15,14,48,942,19,10,28.990532000000002]
[17,"BOWELL, Ian & WATTS, Mike",16,13,80,829,17,4.333333333333333,28.991630000000001]
[18,"McCOY, Kenny & PEMBERTON, Andy",13,16,35,764,15,14.666666666666666,28.992325000000001]
[19,"RYDER, Edde & BALL, Keith",18,11,56,761,15,13.666666666666666,28.992334]
[20,"FALK, Dave & SMART, Neil",15,15,87,1015,21,2.3333333333333335,29.989763]
[21,"SPALL, Chris & BORDIANU, Adrian",17,13,65,770,16,0.66666666666666663,29.992235000000001]
[22,"WALES, Joe & THORNTON, Lee",12,19,72,927,19,5,30.990658]
[23,"SMITH, Stephen & YALLOP, Stephen",20,11,79,665,13,13.666666666666666,30.993271]
[24,"TOPPING, Mike & GALLACHER, Andy",18,14,75,898,18,11.333333333333334,31.990945]
[25,"McGILLOWAY, Wayne & SELF, Bevan",20,12,52,870,18,2,31.991247999999999]
[26,"RUSSELL, Shane & FRARY, June",17,15,39,819,17,1,31.991771]
[27,"BUY, Craig & NICHOLSON, Steven",12,20,37,809,16,13.666666666666666,31.991873000000002]
[28,"HUTCHINSON, Dave & PRICE, Alan",15,17,55,720,15,0,31.992744999999999]
[29,"FRENCH, Julian & AUSTIN, John",16,16,24,691,14,6.333333333333333,31.993065999999999]
[30,"DENHOLM, Paul & BOTEZATO, Constantin",14,18,40,490,10,3.3333333333333335,31.995060000000002]
[31,"DRAYTON, Simon & HIPPERSON, Richard",13,20,73,788,16,6.666666666666667,32.992046999999999]
[32,"FRARY, Charlie & THOMAS, Tony",15,18,38,519,10,13,32.994771999999998]
[33,"WOOD, Gary & HADDOCK, Roy",14,20,35,613,12,12.333333333333334,33.993835000000004]
[34,"CUTLER, Neil & WHITE, Alan",17,17,75,599,12,7.666666666666667,33.993935]
[35,"COTTER, Brett & KINGDON, Adam",19,15,16,467,9,11.666666666666666,33.995314]
[36,"SMITH, George & HENNEY, Jimmy",18,17,37,988,20,9.3333333333333339,34.990082999999998]
[37,"SERBAN, Nelu & TOPPING, Jack",15,20,29,657,13,11,34.993400999999999]
[38,"PRICE, Jimmy & BANHAM, Jason",17,19,73,698,14,8.6666666666666661,35.992947000000001]
[39,"PLUMSTEAD, Joe & BANCROFT, Dave",11,25,65,642,13,6,35.993515000000002]
[40,"DOY, Alan & KIMBLE, John",18,18,64,622,12,15.333333333333334,35.993715999999999]
[41,"PAGE, Saul & HANCOX, Karen",21,15,27,621,12,15,35.993762999999994]
[42,"ELLIOTT, Nathan & HARVEY, Paul ",19,17,30,555,11,9,35.994419999999998]
[43,"LEE, Phil & PARKER, Daniel",15,21,39,425,8,13.666666666666666,35.995711]
[44,"LEE, Martin & SMITH, Leon",20,17,48,841,17,8.3333333333333339,36.991542000000003]
[45,"PINDER, Mark & HIGHFIELD, Nik",21,17,21,699,14,9,37.992989000000001]
[46,"MOORING, Luke & BROCK, Peter",20,18,29,624,13,0,37.993731000000004]
[47,"COOPER, Phillip & NELSON, Ian",19,19,24,563,11,11.666666666666666,37.994346]
[48,"PROVINS, Colin & LAMBERT, Ian",16,22,27,484,10,1.3333333333333333,37.995132999999996]
[49,"ROYALL, Tony  & MARTLAND, Kev",15,24,72,752,15,10.666666666666666,38.992407999999998]
[50,"WRIGHT, Dave & HURCOMBE, Mark",18,21,27,722,15,0.66666666666666663,38.992753]
[51,"EDWARDS, Lee & LILL, Jarrod",20,19,56,638,13,4.666666666666667,38.993563999999999]
[52,"THORPE, Doug & BETTINSON, Charles",21,19,43,621,12,15,39.993746999999999]
[53,"ALDOUS, David & STEBBINGS, Robert",18,22,65,554,11,8.6666666666666661,39.994394999999997]
[54,"CARTER, John & PEARCE, Vic",17,24,49,554,11,8.6666666666666661,40.994410999999999]
[55,"GREEN, Kevin & DIAPER, Greg",21,22,53,525,10,15,42.994697000000002]
[56,"ROBERTS, Steve & PARKER, Al",18,25,15,379,7,14.333333333333334,42.996195]
[57,"WELLS, Thomas & LEE, Louise",21,24,27,567,11,13,44.994302999999995]
[58,"YALLOP, Oliver & STORER, Paul",21,24,36,405,8,7,44.995913999999999]
[59,"ROPER, Liam & JOHNSON, Billy",15,30,34,369,7,11,44.996276000000002]

{"sheet":"SAMF Qualifiers","index":10,"n_rows":57,"n_cols":7,"rows_kept":57,"cut":false,"hidden":false,"merged":[[27,1,27,6],[28,2,28,6],[29,0,30,0],[29,1,30,1],[29,2,30,2],[29,5,30,5],[29,6,30,6],[0,2,0,6],[1,0,2,0],[1,1,2,1],[1,2,2,2],[1,5,2,5],[1,6,2,6]]}
[null,null,"Day 1 SAMF Qualifiers"]
["Qualifier Number","Name","Weight Points","Weight",null,"Qualifiers","Position"]
[null,null,null,"(lbs)","(ozs)"]
[1,"PLUMSTEAD, Joe",221,4,9.6666666666666661,"QUALIFIED",1]
[2,"RUSSELL, Shane",194,4,0.66666666666666663,"QUALIFIED",2]
[3,"LEE, Martin",186,3,14,"QUALIFIED",3]
[4,"HUTCHINSON, Dave",118,2,7.333333333333333,"QUALIFIED",4]
[5,"ELLIOTT, Nathan",98,2,0.66666666666666663,"QUALIFIED",5]
[6,"ROBERTS, Steve",91,1,14.333333333333334,null,6]
[7,"KNIGHT, Simon",81,1,11,null,7]
[8,"HUTSON, Garry",79,1,10.333333333333334,null,8]
[9,"JOHNSON, Billy",75,1,9,null,9]
[10,"LAMBERT, Ian",74,1,8.6666666666666661,null,10]
[11,"HARRISON, Paul",63,1,5,null,11]
[12,"PRICE, Ben",58,1,3.3333333333333335,null,12]
[13,"COOPER, Sam",48,1,0,null,13]
[14,"LILL, Jarrod",0,0,0,null,14]
[15,"","","","",null,""]
[16,"","","","",null,""]
[17,"","","","",null,""]
[18,"","","","",null,""]
[19,"","","","",null,""]
[20,"","","","",null,""]
[21,"","","","",null,""]
[22,"","","","",null,""]
[23,"","","","",null,""]
[24,"","","","",null,""]
[null,"(Please note … 1 IN 3 QUALIFY EACH DAY.  FOR DAY 1, 5 ANGLERS OUT OF 14 QUALIFY.  FOR DAY 2, THE 5 QUALIFIERS FOR DAY 1 ARE REMOVED SO 3 ANGLERS OUT OF 9 QUALIFY.  ALTOGETHER 8 ANGLERS QUALIFY FROM THE BASS FESTIVAL)"]
[null,null,"Day 2 SAMF Qualifiers"]
["Qualifier Number","Name","Weight Points","Weight",null,"Qualifiers","Position"]
[null,null,null,"(lbs)","(ozs)"]
[1,"PRICE, Ben",502,10,7.333333333333333,"QUALIFIED",1]
[2,"RUSSELL, Shane",484,10,1.3333333333333333,null,2]
[3,"ELLIOTT, Nathan",415,8,10.333333333333334,null,3]
[4,"HUTSON, Garry",339,7,1,"QUALIFIED",4]
[5,"LEE, Martin",336,7,0,null,5]
[6,"PLUMSTEAD, Joe",284,5,14.666666666666666,null,6]
[7,"HARRISON, Paul",283,5,14.333333333333334,"QUALIFIED",7]
[8,"ROBERTS, Steve",249,5,3,null,8]
[9,"COOPER, Sam",229,4,12.333333333333334,null,9]
[10,"HUTCHINSON, Dave",221,4,9.6666666666666661,null,10]
[11,"LILL, Jarrod",202,4,3.3333333333333335,null,11]
[12,"JOHNSON, Billy",112,2,5.333333333333333,null,12]
[13,"KNIGHT, Simon",68,1,6.666666666666667,null,13]
[14,"LAMBERT, Ian",24,0,8,null,14]
[15,"","","","",null,""]
[16,"","","","",null,""]
[17,"","","","",null,""]
[18,"","","","",null,""]
[19,"","","","",null,""]
[20,"","","","",null,""]
[21,"","","","",null,""]
[22,"","","","",null,""]
[23,"","","","",null,""]
[24,"","","","",null,""]
[25,"","","","",null,""]
[26,"","","","",null,""]

{"sheet":"Day 1 Zone results (All))","index":11,"n_rows":249,"n_cols":10,"rows_kept":249,"cut":false,"hidden":false,"merged":[[218,1,218,4],[218,5,218,9],[219,0,220,0],[219,1,220,1],[219,2,220,2],[219,3,220,3],[219,4,220,4],[219,7,220,7],[219,8,220,8],[219,9,220,9],[185,1,185,4],[185,5,185,9],[186,0,187,0],[186,1,187,1],[186,2,187,2],[186,3,187,3],[186,4,187,4],[186,7,187,7],[186,8,187,8],[186,9,187,9],[165,1,165,4],[165,5,165,9],[166,0,167,0],[166,1,167,1],[166,2,167,2],[166,3,167,3],[166,4,167,4],[166,7,167,7],[166,8,167,8],[166,9,167,9],[132,1,132,4],[132,5,132,9],[133,0,134,0],[133,1,134,1],[133,2,134,2],[133,3,134,3],[133,4,134,4],[133,7,134,7],[133,8,134,8],[133,9,134,9],[99,1,99,4],[99,5,99,9],[100,0,101,0],[100,1,101,1],[100,2,101,2],[100,3,101,3],[100,4,101,4],[100,7,101,7],[100,8,101,8],[100,9,101,9],[66,1,66,4],[66,5,66,9],[67,0,68,0],[67,1,68,1],[67,2,68,2],[67,3,68,3],[67,4,68,4],[67,7,68,7],[67,8,68,8],[67,9,68,9],[33,1,33,4],[33,5,33,9],[34,0,35,0],[34,1,35,1],[34,2,35,2],[34,3,35,3],[34,4,35,4],[34,7,35,7],[34,8,35,8],[34,9,35,9],[0,1,0,4],[0,5,0,9],[1,0,2,0],[1,1,2,1],[1,2,2,2],[1,3,2,3],[1,4,2,4],[1,7,2,7],[1,8,2,8],[1,9,2,9]]}
[null,"NORTH NORFOLK BASS FESTIVAL 2020-21",null,null,null,"Day 1  ZONE A"]
["Zone Number","Peg","Name","No. Fish","Total Weight Points","Weight",null,"Optional Pools","Day 1 Points ","Zone Position"]
[null,null,null,null,null,"(lbs)","(ozs)"]
[1,4,"WALES, Joe",15,448,9,5.333333333333333,"X",1,1]
[2,16,"BURT, Richard",21,367,7,10.333333333333334,"X",2,2]
[3,12,"LAY-FLURRIE, Matt",15,236,4,14.666666666666666,"X",3,3]
[4,2,"CROSBY, Colin",8,214,4,7.333333333333333,"X",4,4]
[5,3,"YALLOP, Oliver",7,213,4,7,"X",5,5]
[6,6,"McGILLOWAY, Wayne",7,197,4,1.6666666666666667,"X",6,6]
[7,14,"TOPPING, Mike",8,140,2,14.666666666666666,"X",7,7]
[8,15,"BOWELL, Ian",12,137,2,13.666666666666666,"X",8,8]
[9,13,"TOPPING, Jack",7,135,2,13,"X",9,9]
[10,7,"HIPPERSON, Richard",7,110,2,4.666666666666667,"X",10,10]
[11,11,"GALLACHER, Andy",7,99,2,1,"X",11,11]
[12,8,"STEBBINGS, Robert",9,84,1,12,"X",12,12]
[13,5,"JOHNSON, Billy",3,75,1,9,"X",13,13]
[14,9,"HIGHFIELD, Nik",4,53,1,1.6666666666666667,"X",14,14]
[15,10,"COOPER, Sam",3,48,1,0,"X",15,15]
[16,"","","","","","","","",""]
[17,"","","","","","","","",""]
[18,"","","","","","","","",""]
[19,"","","","","","","","",""]
[20,"","","","","","","","",""]
[21,"","","","","","","","",""]
[22,"","","","","","","","",""]
[23,"","","","","","","","",""]
[24,"","","","","","","","",""]
[25,"","","","","","","","",""]
[26,"","","","","","","","",""]
[27,"","","","","","","","",""]
[28,"","","","","","","","",""]
[29,"","","","","","","","",""]
[30,"","","","","","","","",""]
[null,"NORTH NORFOLK BASS FESTIVAL 2020-21",null,null,null,"Day 1  ZONE B"]
["Zone Number","Peg","Name","No. Fish","Total Weight Points","Weight",null,"Optional Pools","Day 1 Points ","Zone Position"]
[null,null,null,null,null,"(lbs)","(ozs)"]
[1,21,"ROGERS, Mark",20,374,7,12.666666666666666,"X",1,1]
[2,18,"GOOCH, Mark",18,240,5,0,"X",2,2]
[3,20,"PLUMSTEAD, Joe",16,221,4,9.6666666666666661,"X",3,3]
[4,17,"EDWARDS, Lee",16,217,4,8.3333333333333339,"X",4,4]
[5,26,"CARTER, John",8,123,2,9,"X",5,5]
[6,19,"THORPE, Doug",9,110,2,4.666666666666667,"X",6,6]
[7,27,"FRARY, Charlie",6,104,2,2.6666666666666665,"X",7,7]
[8,23,"BANCROFT, Dave",5,60,1,4,"X",8,8]
[9,24,"BROWN, Kay",1,44,0,14.666666666666666,"",9,9]
[10,31,"LINDFIELD, Heather",2,31,0,10.333333333333334,"",10,10]
[11,22,"AKESTER, Jack",3,27,0,9,"X",11,11]
[12,32,"YALLOP, Stephen",2,23,0,7.666666666666667,"X",12,12]
[13,25,"METCALFE, Wendy",1,13,0,4.333333333333333,"",13,13]
[14,28,"FRARY, June",0,0,0,0,"X",16,16]
[15,29,"HANCOX, Karen",0,0,0,0,"X",16,16]
[16,30,"HENNEY, Jimmy",0,0,0,0,"X",16,16]
[17,"","","","","","","","",""]
[18,"","","","","","","","",""]
[19,"","","","","","","","",""]
[20,"","","","","","","","",""]
[21,"","","","","","","","",""]
[22,"","","","","","","","",""]
[23,"","","","","","","","",""]
[24,"","","","","","","","",""]
[25,"","","","","","","","",""]
[26,"","","","","","","","",""]
[27,"","","","","","","","",""]
[28,"","","","","","","","",""]
[29,"","","","","","","","",""]
[30,"","","","","","","","",""]
[null,"NORTH NORFOLK BASS FESTIVAL 2020-21",null,null,null,"Day 1  ZONE C"]
["Zone Number","Peg","Name","No. Fish","Total Weight Points","Weight",null,"Optional Pools","Day 1 Points ","Zone Position"]
[null,null,null,null,null,"(lbs)","(ozs)"]
[1,42,"TUCK, Rob",13,157,3,4.333333333333333,"X",1,1]
[2,38,"DENHOLM, Paul",10,144,3,0,"X",2,2]
[3,43,"McCOY, Kenny",10,103,2,2.3333333333333335,"X",3,3]
[4,39,"ARCH, Joe",8,101,2,1.6666666666666667,"X",4,4]
[5,46,"PAGE, Saul",7,80,1,10.666666666666666,"X",5,5]
[6,45,"COTTER, Brett",4,73,1,8.3333333333333339,"X",6,6]
[7,33,"LEE, Phil",6,66,1,6,"X",7,7]
[8,37,"THOMAS, Tony",3,33,0,11,"X",8,8]
[9,41,"CLEMENT, Alby",3,31,0,10.333333333333334,"X",9,9]
[10,35,"DAWBER, Simon",2,27,0,9,"X",10,10]
[11,47,"HADDOCK, Roy",2,20,0,6.666666666666667,"X",11,11]
[12,34,"HILLS, Amy",0,0,0,0,"",16,16]
[13,36,"MURRAY, Luke (DID NOT FISH)",0,0,0,0,"",16,16]
[14,40,"LILL, Jarrod",0,0,0,0,"X",16,16]
[15,44,"HURCOMBE, Mark",0,0,0,0,"X",16,16]
[16,48,"Unused Pegs 1",0,0,0,0,"",16,16]
[17,"","","","","","","","",""]
[18,"","","","","","","","",""]
[19,"","","","","","","","",""]
[20,"","","","","","","","",""]
[21,"","","","","","","","",""]
[22,"","","","","","","","",""]
[23,"","","","","","","","",""]
[24,"","","","","","","","",""]
[25,"","","","","","","","",""]
[26,"","","","","","","","",""]
[27,"","","","","","","","",""]
[28,"","","","","","","","",""]
[29,"","","","","","","","",""]
[30,"","","","","","","","",""]
[null,"NORTH NORFOLK BASS FESTIVAL 2020-21",null,null,null,"Day 1  ZONE D"]
["Zone Number","Peg","Name","No. Fish","Total Weight Points","Weight",null,"Optional Pools","Day 1 Points ","Zone Position"]
[null,null,null,null,null,"(lbs)","(ozs)"]
[1,63,"BOND, Darren",20,439,9,2.3333333333333335,"X",1,1]
[2,55,"SMITH, George",15,310,6,7.333333333333333,"X",2,2]
[3,62,"DRAYTON, Simon",17,243,5,1,"X",3,3]
[4,49,"BUY, Craig",10,160,3,5.333333333333333,"X",4,4]
[5,52,"WELLS, Thomas",9,149,3,1.6666666666666667,"X",5,5]
[6,50,"SERBAN, Nelu",3,90,1,14,"X",6,6]
[7,54,"COOPER, Phillip",6,85,1,12.333333333333334,"X",7,7]
[8,61,"WATTS, Mike",8,84,1,12,"X",8,8]
[9,53,"HUTSON, Garry",6,79,1,10.333333333333334,"X",9,9]
[10,60,"DIAPER, Barry",5,59,1,3.6666666666666665,"X",10,10]
[11,56,"THORNTON, Lee",5,53,1,1.6666666666666667,"X",11,11]
[12,59,"LINDFIELD, Bill",5,42,0,14,"X",12,12]
[13,51,"AUSTIN, John",3,25,0,8.3333333333333339,"X",13,13]
[14,58,"DIAPER, Greg",2,21,0,7,"X",14,14]
[15,64,"BETTINSON, Charles",1,7,0,2.3333333333333335,"X",15,15]
[16,57,"SMITH, Leon",0,0,0,0,"X",16,16]
[17,"","","","","","","","",""]
[18,"","","","","","","","",""]
[19,"","","","","","","","",""]
[20,"","","","","","","","",""]
[21,"","","","","","","","",""]
[22,"","","","","","","","",""]
[23,"","","","","","","","",""]
[24,"","","","","","","","",""]
[25,"","","","","","","","",""]
[26,"","","","","","","","",""]
[27,"","","","","","","","",""]
[28,"","","","","","","","",""]
[29,"","","","","","","","",""]
[30,"","","","","","","","",""]
[null,"NORTH NORFOLK BASS FESTIVAL 2020-21",null,null,null,"Day 1  ZONE E"]
["Zone Number","Peg","Name","No. Fish","Total Weight Points","Weight",null,"Optional Pools","Day 1 Points ","Zone Position"]
[null,null,null,null,null,"(lbs)","(ozs)"]
[1,72,"RUSSELL, Shane",10,194,4,0.66666666666666663,"X",1,1]
[2,69,"NANGLE, Karl",10,154,3,3.3333333333333335,"X",2,2]
[3,79,"FRENCH, Julian",11,134,2,12.666666666666666,"X",3,3]
[4,65,"ELLIOTT, Nathan",8,98,2,0.66666666666666663,"X",4,4]
[5,68,"ROBERTS, Steve",5,91,1,14.333333333333334,"X",5,5]
[6,66,"PRICE, Jimmy",8,89,1,13.666666666666666,"X",6,6]
[7,71,"TURNER, Cameron",7,89,1,13.666666666666666,"X",7,7]
[8,80,"PARKER, Daniel",6,77,1,9.6666666666666661,"X",8,8]
[9,67,"LAMBERT, Ian",2,74,1,8.6666666666666661,"X",9,9]
[10,77,"PRICE, Alan",6,68,1,6.666666666666667,"X",10,10]
[11,78,"HARRISON, Paul",5,63,1,5,"X",11,11]
[12,73,"NELSON, Ian",2,58,1,3.3333333333333335,"X",12,12]
[13,70,"KINGDON, Adam",3,37,0,12.333333333333334,"X",13,13]
[14,75,"MARTLAND, Kev",2,26,0,8.6666666666666661,"X",14,14]
[15,74,"HARVEY, Paul ",1,12,0,4,"X",15,15]
[16,76,"GIBBS, Tom (DID NOT FISH)",0,0,0,0,"",16,16]
[17,"","","","","","","","",""]
[18,"","","","","","","","",""]
[19,"","","","","","","","",""]
[20,"","","","","","","","",""]
[21,"","","","","","","","",""]
[22,"","","","","","","","",""]
[23,"","","","","","","","",""]
[24,"","","","","","","","",""]
[25,"","","","","","","","",""]
[26,"","","","","","","","",""]
[27,"","","","","","","","",""]
[28,"","","","","","","","",""]
[29,"","","","","","","","",""]
[30,"","","","","","","","",""]
[null,"NORTH NORFOLK BASS FESTIVAL 2020-21",null,null,null,"Day 1  ZONE F"]
["Zone Number","Peg","Name","No. Fish","Total Weight Points","Weight",null,"Optional Pools","Day 1 Points ","Zone Position"]
[null,null,null,null,null,"(lbs)","(ozs)"]
[1,86,"CROSBY, Ralf",7,184,3,13.333333333333334,"X",1,1]
[2,95,"DOY, Alan",7,164,3,6.666666666666667,"X",2,2]
[3,87,"RYDER, Edde",7,122,2,8.6666666666666661,"X",3,3]
[4,83,"SHORTHOUSE, Dave",8,97,2,0.33333333333333331,"X",4,4]
[5,84,"TAYLOR, Mark",8,94,1,15.333333333333334,"X",5,5]
[6,93,"ALDOUS, David",8,93,1,15,"X",6,6]
[7,96,"PINDER, Mark",6,90,1,14,"X",7,7]
[8,88,"SMITH, Stephen",8,85,1,12.333333333333334,"X",8,8]
[9,81,"WHITE, Alan",6,61,1,4.333333333333333,"X",9,9]
[10,85,"PRICE, Ben",5,58,1,3.3333333333333335,"X",10,10]
[11,90,"PARKER, Gavin",4,46,0,15.333333333333334,"X",11,11]
[12,91,"BORDIANU, Adrian",4,46,0,15.333333333333334,"X",11,11]
[13,92,"PARKER, Al",2,25,0,8.3333333333333339,"X",13,13]
[14,82,"SMART, Neil",2,16,0,5.333333333333333,"X",14,14]
[15,94,"ALDOUS, Brayden",1,12,0,4,"",15,15]
[16,89,"STORER, Paul",0,0,0,0,"X",16,16]
[30,"","","","","","","","",""]
[null,"NORTH NORFOLK BASS FESTIVAL 2020-21",null,null,null,"Day 1  ZONE G"]
["Zone Number","Peg","Name","No. Fish","Total Weight Points","Weight",null,"Optional Pools","Day 1 Points ","Zone Position"]
[null,null,null,null,null,"(lbs)","(ozs)"]
[1,99,"FALK, Dave",19,226,4,11.333333333333334,"X",1,1]
[2,107,"ROPER, Liam",5,182,3,12.666666666666666,"X",2,2]
[3,105,"WOOD, Gary",9,130,2,11.333333333333334,"X",3,3]
[4,111,"MOORING, Luke",11,124,2,9.3333333333333339,"X",4,4]
[5,102,"HUTCHINSON, Dave",11,118,2,7.333333333333333,"X",5,5]
[6,108,"PERRY, Joe",6,118,2,7.333333333333333,"X",6,6]
[7,110,"PROVINS, Colin",6,63,1,5,"X",7,7]
[8,104,"NICHOLSON, Steven",5,62,1,4.666666666666667,"X",8,8]
[9,112,"WICKS, Maralyn",2,60,1,4,"X",9,9]
[10,98,"GASCOIGNE, Robert",7,58,1,3.3333333333333335,"X",10,10]
[11,103,"HAZELGROVE, Gary",4,48,1,0,"X",11,11]
[12,106,"PEARCE, Vic",4,45,0,15,"X",12,12]
[13,101,"ADAMS, Graham",3,35,0,11.666666666666666,"X",13,13]
[14,100,"SELF, Bevan",3,34,0,11.333333333333334,"X",14,14]
[15,97,"BALL, Keith",2,21,0,7,"X",15,15]
[16,109,"KIMBLE, John",0,0,0,0,"X",16,16]
[17,"","","","","","","","",""]
[18,"","","","","","","","",""]
[19,"","","","","","","","",""]
[20,"","","","","","","","",""]
[21,"","","","","","","","",""]
[22,"","","","","","","","",""]
[23,"","","","","","","","",""]
[24,"","","","","","","","",""]
[25,"","","","","","","","",""]
[26,"","","","","","","","",""]
[27,"","","","","","","","",""]
[28,"","","","","","","","",""]
[29,"","","","","","","","",""]
[30,"","","","","","","","",""]
[null,"NORTH NORFOLK BASS FESTIVAL 2020-21",null,null,null,"Day 1  ZONE H"]
["Zone Number","Peg","Name","No. Fish","Total Weight Points","Weight",null,"Optional Pools","Day 1 Points ","Zone Position"]
[null,null,null,null,null,"(lbs)","(ozs)"]
[1,123,"ROYALL, Tony ",16,335,6,15.666666666666666,"X",1,1]
[2,113,"WRIGHT, Dave",11,247,5,2.3333333333333335,"X",2,2]
[3,118,"GARDINER, Gareth",15,243,5,1,"X",3,3]
[4,120,"LEE, Martin",7,186,3,14,"X",4,4]
[5,128,"ADAMS, Stephen",9,183,3,13,"X",5,5]
[6,125,"SPALL, Chris",14,177,3,11,"X",6,6]
[7,122,"GREEN, Kevin",9,177,3,11,"X",7,7]
[8,127,"CUTLER, Neil",9,115,2,6.333333333333333,"X",8,8]
[9,121,"KNIGHT, Simon",7,81,1,11,"X",9,9]
[10,117,"PEMBERTON, Andy",5,66,1,6,"X",10,10]
[11,114,"BANHAM, Jason",6,65,1,5.666666666666667,"X",11,11]
[12,116,"BOTEZATO, Constantin",2,18,0,6,"X",12,12]
[13,115,"BANHAM, Mark",1,16,0,5.333333333333333,"",13,13]
[14,126,"CREASEY, Shaun",1,16,0,5.333333333333333,"X",13,13]
[15,119,"LEE, Louise",0,0,0,0,"X",16,16]
[16,124,"BROCK, Peter",0,0,0,0,"X",16,16]
[17,"","","","","","","","",""]
[18,"","","","","","","","",""]
[19,"","","","","","","","",""]
[20,"","","","","","","","",""]
[21,"","","","","","","","",""]
[22,"","","","","","","","",""]
[23,"","","","","","","","",""]
[24,"","","","","","","","",""]
[25,"","","","","","","","",""]
[26,"","","","","","","","",""]
[27,"","","","","","","","",""]
[28,"","","","","","","","",""]

{"sheet":"Day 2 Zone results (All)","index":12,"n_rows":261,"n_cols":10,"rows_kept":261,"cut":false,"hidden":false,"merged":[[230,1,230,4],[230,5,230,9],[231,0,232,0],[231,1,232,1],[231,2,232,2],[231,3,232,3],[231,4,232,4],[231,7,232,7],[231,8,232,8],[231,9,232,9],[197,1,197,4],[197,5,197,9],[198,0,199,0],[198,1,199,1],[198,2,199,2],[198,3,199,3],[198,4,199,4],[198,7,199,7],[198,8,199,8],[198,9,199,9],[164,1,164,4],[164,5,164,9],[165,0,166,0],[165,1,166,1],[165,2,166,2],[165,3,166,3],[165,4,166,4],[165,7,166,7],[165,8,166,8],[165,9,166,9],[131,1,131,4],[131,5,131,9],[132,0,133,0],[132,1,133,1],[132,2,133,2],[132,3,133,3],[132,4,133,4],[132,7,133,7],[132,8,133,8],[132,9,133,9],[98,1,98,4],[98,5,98,9],[99,0,100,0],[99,1,100,1],[99,2,100,2],[99,3,100,3],[99,4,100,4],[99,7,100,7],[99,8,100,8],[99,9,100,9],[65,1,65,4],[65,5,65,9],[66,0,67,0],[66,1,67,1],[66,2,67,2],[66,3,67,3],[66,4,67,4],[66,7,67,7],[66,8,67,8],[66,9,67,9],[33,1,33,4],[33,5,33,9],[34,0,35,0],[34,1,35,1],[34,2,35,2],[34,3,35,3],[34,4,35,4],[34,7,35,7],[34,8,35,8],[34,9,35,9],[0,1,0,4],[0,5,0,9],[1,0,2,0],[1,1,2,1],[1,2,2,2],[1,3,2,3],[1,4,2,4],[1,7,2,7],[1,8,2,8],[1,9,2,9]]}
[null,"NORTH NORFOLK BASS FESTIVAL 2020-21",null,null,null,"Day 2  ZONE A"]
["Zone Number","Peg","Name","No. Fish","Total Weight Points","Weight",null,"Optional Pools","Day 2 Points ","Zone Position"]
[null,null,null,null,null,"(lbs)","(ozs)"]
[1,1,"GARDINER, Gareth",23,754,15,11.333333333333334,"X",1,1]
[2,12,"SHORTHOUSE, Dave",34,651,13,9,"X",2,2]
[3,13,"CROSBY, Ralf",41,624,13,0,"X",3,3]
[4,8,"TAYLOR, Mark",25,531,11,1,"X",4,4]
[5,11,"BALL, Keith",25,365,7,9.6666666666666661,"X",5,5]
[6,9,"GASCOIGNE, Robert",24,344,7,2.6666666666666665,"X",6,6]
[7,4,"SPALL, Chris",30,294,6,2,"X",7,7]
[8,2,"HARRISON, Paul",17,283,5,14.333333333333334,"X",8,8]
[9,6,"BANHAM, Jason",22,275,5,11.666666666666666,"X",9,9]
[10,15,"PRICE, Jimmy",18,269,5,9.6666666666666661,"X",10,10]
[11,14,"ROBERTS, Steve",14,249,5,3,"X",11,11]
[12,5,"PEMBERTON, Andy",20,239,4,15.666666666666666,"X",12,12]
[13,3,"SMART, Neil",20,234,4,14,"X",13,13]
[14,10,"MARTLAND, Kev",18,214,4,7.333333333333333,"X",14,14]
[15,16,"LEE, Louise",12,179,3,11.666666666666666,"X",15,15]
[16,7,"BANHAM, Mark",9,151,3,2.3333333333333335,"",16,16]
[17,"","","","","","","","",""]
[18,"","","","","","","","",""]
[19,"","","","","","","","",""]
[20,"","","","","","","","",""]
[21,"","","","","","","","",""]
[22,"","","","","","","","",""]
[23,"","","","","","","","",""]
[24,"","","","","","","","",""]
[25,"","","","","","","","",""]
[26,"","","","","","","","",""]
[27,"","","","","","","","",""]
[28,"","","","","","","","",""]
[29,"","","","","","","","",""]
[30,"","","","","","","","",""]
[null,"NORTH NORFOLK BASS FESTIVAL 2020-21",null,null,null,"Day 2  ZONE B"]
["Zone Number","Peg","Name","No. Fish","Total Weight Points","Weight",null,"Optional Pools","Day 2 Points ","Zone Position"]
[null,null,null,null,null,"(lbs)","(ozs)"]
[1,20,"ADAMS, Graham",36,611,12,11.666666666666666,"X",1,1]
[2,32,"FALK, Dave",37,539,11,3.6666666666666665,"X",2,2]
[3,18,"NANGLE, Karl",27,502,10,7.333333333333333,"X",3,3]
[4,25,"PERRY, Joe",35,499,10,6.333333333333333,"X",4,4]
[5,27,"WRIGHT, Dave",22,475,9,14.333333333333334,"X",5,5]
[6,31,"WOOD, Gary",23,356,7,6.666666666666667,"X",6,6]
[7,24,"FRENCH, Julian",29,347,7,3.6666666666666665,"X",7,7]
[8,17,"LEE, Martin",22,336,7,0,"X",8,8]
[9,30,"PROVINS, Colin",28,323,6,11.666666666666666,"X",9,9]
[10,26,"WICKS, Maralyn",18,265,5,8.3333333333333339,"X",10,10]
[11,19,"KIMBLE, John",20,260,5,6.666666666666667,"X",11,11]
[12,21,"PEARCE, Vic",19,238,4,15.333333333333334,"X",12,12]
[13,22,"HUTCHINSON, Dave",20,221,4,9.6666666666666661,"X",13,13]
[14,23,"NICHOLSON, Steven",8,201,4,3,"X",14,14]
[15,28,"ALDOUS, David",12,119,2,7.666666666666667,"X",15,15]
[16,29,"ALDOUS, Brayden",6,77,1,9.6666666666666661,"",16,16]
[17,"","","","","","","","",""]
[18,"","","","","","","","",""]
[19,"","","","","","","","",""]
[20,"","","","","","","","",""]
[21,"","","","","","","","",""]
[22,"","","","","","","","",""]
[23,"","","","","","","","",""]
[24,"","","","","","","","",""]
[25,"","","","","","","","",""]
[26,"","","","","","","","",""]
[27,"","","","","","","","",""]
[28,"","","","","","","","",""]
[29,"","","","","","","","",""]
[null,"NORTH NORFOLK BASS FESTIVAL 2020-21",null,null,null,"Day 2  ZONE C"]
["Zone Number","Peg","Name","No. Fish","Total Weight Points","Weight",null,"Optional Pools","Day 2 Points ","Zone Position"]
[null,null,null,null,null,"(lbs)","(ozs)"]
[1,41,"PRICE, Ben",20,502,10,7.333333333333333,"X",1,1]
[2,37,"TURNER, Cameron",22,447,9,5,"X",2,2]
[3,40,"CUTLER, Neil",22,351,7,5,"X",3,3]
[4,47,"PRICE, Alan",9,313,6,8.3333333333333339,"X",4,4]
[5,33,"SELF, Bevan",20,288,6,0,"X",5,5]
[6,38,"BORDIANU, Adrian",17,253,5,4.333333333333333,"X",6,6]
[7,39,"DOY, Alan",9,198,4,2,"X",7,7]
[8,48,"KINGDON, Adam",8,147,3,1,"X",8,8]
[9,35,"STORER, Paul",9,115,2,6.333333333333333,"X",9,9]
[10,42,"CREASEY, Shaun",2,112,2,5.333333333333333,"X",10,10]
[11,46,"PARKER, Gavin",3,34,0,11.333333333333334,"X",11,11]
[12,44,"HARVEY, Paul ",3,30,0,10,"X",12,12]
[13,36,"LAMBERT, Ian",2,24,0,8,"X",13,13]
[14,45,"PARKER, Al",1,14,0,4.666666666666667,"X",14,14]
[15,34,"BROCK, Peter",0,0,0,0,"X",16,16]
[16,43,"GIBBS, Tom (DID NOT FISH)",0,0,0,0,"",16,16]
[17,"","","","","","","","",""]
[18,"","","","","","","","",""]
[19,"","","","","","","","",""]
[20,"","","","","","","","",""]
[21,"","","","","","","","",""]
[22,"","","","","","","","",""]
[23,"","","","","","","","",""]
[24,"","","","","","","","",""]
[25,"","","","","","","","",""]
[26,"","","","","","","","",""]
[27,"","","","","","","","",""]
[28,"","","","","","","","",""]
[29,"","","","","","","","",""]
[30,"","","","","","","","",""]
[null,"NORTH NORFOLK BASS FESTIVAL 2020-21",null,null,null,"Day 2  ZONE D"]
["Zone Number","Peg","Name","No. Fish","Total Weight Points","Weight",null,"Optional Pools","Day 2 Points ","Zone Position"]
[null,null,null,null,null,"(lbs)","(ozs)"]
[1,51,"ADAMS, Stephen",16,557,11,9.6666666666666661,"X",1,1]
[2,62,"MOORING, Luke",27,500,10,6.666666666666667,"X",2,2]
[3,58,"RUSSELL, Shane",16,484,10,1.3333333333333333,"X",3,3]
[4,60,"PINDER, Mark",18,436,9,1.3333333333333333,"X",4,4]
[5,64,"ELLIOTT, Nathan",29,415,8,10.333333333333334,"X",5,5]
[6,49,"RYDER, Edde",14,253,5,4.333333333333333,"X",6,6]
[7,59,"NELSON, Ian",16,210,4,6,"X",7,7]
[8,53,"SMITH, Stephen",12,190,3,15.333333333333334,"X",8,8]
[9,61,"GREEN, Kevin",16,183,3,13,"X",9,9]
[10,63,"ROYALL, Tony ",12,177,3,11,"X",10,10]
[11,55,"HAZELGROVE, Gary",12,151,3,2.3333333333333335,"X",11,11]
[12,56,"BOTEZATO, Constantin",11,112,2,5.333333333333333,"X",12,12]
[13,57,"PARKER, Daniel",7,97,2,0.33333333333333331,"X",13,13]
[14,52,"WHITE, Alan",6,72,1,8,"X",14,14]
[15,50,"KNIGHT, Simon",5,68,1,6.666666666666667,"X",15,15]
[16,54,"ROPER, Liam",0,0,0,0,"X",16,16]
[17,"","","","","","","","",""]
[18,"","","","","","","","",""]
[19,"","","","","","","","",""]
[20,"","","","","","","","",""]
[21,"","","","","","","","",""]
[22,"","","","","","","","",""]
[23,"","","","","","","","",""]
[24,"","","","","","","","",""]
[25,"","","","","","","","",""]
[26,"","","","","","","","",""]
[27,"","","","","","","","",""]
[28,"","","","","","","","",""]
[29,"","","","","","","","",""]
[30,"","","","","","","","",""]
[null,"NORTH NORFOLK BASS FESTIVAL 2020-21",null,null,null,"Day 2  ZONE E"]
["Zone Number","Peg","Name","No. Fish","Total Weight Points","Weight",null,"Optional Pools","Day 2 Points ","Zone Position"]
[null,null,null,null,null,"(lbs)","(ozs)"]
[1,77,"TUCK, Rob",23,868,18,1.3333333333333333,"X",1,1]
[2,66,"PAGE, Saul",37,404,8,6.666666666666667,"X",2,2]
[3,67,"DIAPER, Barry",21,252,5,4,"X",3,3]
[4,65,"COOPER, Sam",18,229,4,12.333333333333334,"X",4,4]
[5,76,"LAY-FLURRIE, Matt",18,222,4,10,"X",5,5]
[6,80,"DENHOLM, Paul",18,216,4,8,"X",6,6]
[7,73,"COTTER, Brett",11,210,4,6,"X",7,7]
[8,71,"LEE, Phil",18,185,3,13.666666666666666,"X",8,8]
[9,74,"AUSTIN, John",10,185,3,13.666666666666666,"X",9,9]
[10,69,"DAWBER, Simon",15,181,3,12.333333333333334,"X",10,10]
[11,75,"BOWELL, Ian",19,173,3,9.6666666666666661,"X",11,11]
[12,68,"THOMAS, Tony",7,133,2,12.333333333333334,"X",12,12]
[13,78,"HIGHFIELD, Nik",11,120,2,8,"X",13,13]
[14,72,"JOHNSON, Billy",13,112,2,5.333333333333333,"X",14,14]
[15,70,"Unused Pegs 1",0,0,0,0,"",16,16]
[16,79,"HILLS, Amy",0,0,0,0,"",16,16]
[17,"","","","","","","","",""]
[18,"","","","","","","","",""]
[19,"","","","","","","","",""]
[20,"","","","","","","","",""]
[21,"","","","","","","","",""]
[22,"","","","","","","","",""]
[23,"","","","","","","","",""]
[24,"","","","","","","","",""]
[25,"","","","","","","","",""]
[26,"","","","","","","","",""]
[27,"","","","","","","","",""]
[28,"","","","","","","","",""]
[29,"","","","","","","","",""]
[30,"","","","","","","","",""]
[null,"NORTH NORFOLK BASS FESTIVAL 2020-21",null,null,null,"Day 2  ZONE F"]
["Zone Number","Peg","Name","No. Fish","Total Weight Points","Weight",null,"Optional Pools","Day 2 Points ","Zone Position"]
[null,null,null,null,null,"(lbs)","(ozs)"]
[1,95,"LINDFIELD, Bill",37,479,9,15.666666666666666,"X",1,1]
[2,82,"GOOCH, Mark",32,438,9,2,"X",2,2]
[3,88,"BURT, Richard",33,393,8,3,"X",3,3]
[4,81,"McCOY, Kenny",17,356,7,6.666666666666667,"X",4,4]
[5,93,"CLEMENT, Alby",30,302,6,4.666666666666667,"X",5,5]
[6,92,"SERBAN, Nelu",25,298,6,3.3333333333333335,"X",6,6]
[7,83,"STEBBINGS, Robert",18,258,5,6,"X",7,7]
[8,94,"THORNTON, Lee",22,254,5,4.666666666666667,"X",8,8]
[9,91,"WELLS, Thomas",18,239,4,15.666666666666666,"X",9,9]
[10,87,"TOPPING, Mike",22,221,4,9.6666666666666661,"X",10,10]
[11,85,"EDWARDS, Lee",16,219,4,9,"X",11,11]
[12,89,"COOPER, Phillip",17,210,4,6,"X",12,12]
[13,84,"DRAYTON, Simon",19,186,3,14,"X",13,13]
[14,86,"TOPPING, Jack",14,134,2,12.666666666666666,"X",14,14]
[15,90,"YALLOP, Oliver",7,77,1,9.6666666666666661,"X",15,15]
[16,96,"HURCOMBE, Mark",0,0,0,0,"X",16,16]
[17,"","","","","","","","",""]
[18,"","","","","","","","",""]
[19,"","","","","","","","",""]
[20,"","","","","","","","",""]
[21,"","","","","","","","",""]
[22,"","","","","","","","",""]
[23,"","","","","","","","",""]
[24,"","","","","","","","",""]
[25,"","","","","","","","",""]
[26,"","","","","","","","",""]
[27,"","","","","","","","",""]
[28,"","","","","","","","",""]
[29,"","","","","","","","",""]
[30,"","","","","","","","",""]
[null,"NORTH NORFOLK BASS FESTIVAL 2020-21",null,null,null,"Day 2  ZONE G"]
["Zone Number","Peg","Name","No. Fish","Total Weight Points","Weight",null,"Optional Pools","Day 2 Points ","Zone Position"]
[null,null,null,null,null,"(lbs)","(ozs)"]
[1,99,"ROGERS, Mark",46,504,10,8,"X",1,1]
[2,103,"WATTS, Mike",42,435,9,1,"X",2,2]
[3,100,"YALLOP, Stephen",36,367,7,10.333333333333334,"X",3,3]
[4,97,"ARCH, Joe",32,325,6,12.333333333333334,"X",4,4]
[5,102,"AKESTER, Jack",29,271,5,10.333333333333334,"X",5,5]
[6,112,"FRARY, Charlie",23,249,5,3,"X",6,6]
[7,108,"HIPPERSON, Richard",22,249,5,3,"X",7,7]
[8,111,"LILL, Jarrod",18,202,4,3.3333333333333335,"X",8,8]
[9,104,"LINDFIELD, Heather",20,194,4,0.66666666666666663,"",9,9]
[10,106,"BROWN, Kay",16,160,3,5.333333333333333,"",10,10]
[11,107,"METCALFE, Wendy",13,155,3,3.6666666666666665,"",11,11]
[12,110,"CARTER, John",17,148,3,1.3333333333333333,"X",12,12]
[13,105,"DIAPER, Greg",13,144,3,0,"X",13,13]
[14,98,"BETTINSON, Charles",13,106,2,3.3333333333333335,"X",14,14]
[15,109,"BANCROFT, Dave",8,77,1,9.6666666666666661,"X",15,15]
[16,101,"MURRAY, Luke (DID NOT FISH)",0,0,0,0,"",16,16]
[17,"","","","","","","","",""]
[18,"","","","","","","","",""]
[19,"","","","","","","","",""]
[20,"","","","","","","","",""]
[21,"","","","","","","","",""]
[22,"","","","","","","","",""]
[23,"","","","","","","","",""]
[24,"","","","","","","","",""]
[25,"","","","","","","","",""]
[26,"","","","","","","","",""]
[27,"","","","","","","","",""]
[28,"","","","","","","","",""]
[29,"","","","","","","","",""]
[30,"","","","","","","","",""]
[null,"NORTH NORFOLK BASS FESTIVAL 2020-21",null,null,null,"Day 2  ZONE H"]
["Zone Number","Peg","Name","No. Fish","Total Weight Points","Weight",null,"Optional Pools","Day 2 Points ","Zone Position"]
[null,null,null,null,null,"(lbs)","(ozs)"]
[1,127,"BOND, Darren",54,583,12,2.3333333333333335,"X",1,1]
[2,128,"SMITH, George",47,572,11,14.666666666666666,"X",2,2]
[3,121,"CROSBY, Colin",44,522,10,14,"X",3,3]
[4,119,"GALLACHER, Andy",46,438,9,2,"X",4,4]
[5,123,"THORPE, Doug",36,398,8,4.666666666666667,"X",5,5]
[6,122,"BUY, Craig",29,386,8,0.66666666666666663,"X",6,6]
[7,117,"McGILLOWAY, Wayne",32,351,7,5,"X",7,7]
[8,126,"HUTSON, Garry",31,339,7,1,"X",8,8]
[9,125,"SMITH, Leon",30,319,6,10.333333333333334,"X",9,9]
[10,115,"PLUMSTEAD, Joe",26,284,5,14.666666666666666,"X",10,10]
[11,114,"WALES, Joe",17,172,3,9.3333333333333339,"X",11,11]
[12,113,"FRARY, June",16,141,2,15,"X",12,12]
[13,116,"HANCOX, Karen",17,137,2,13.666666666666666,"X",13,13]
[14,120,"HADDOCK, Roy",11,107,2,3.6666666666666665,"X",14,14]
[15,118,"HENNEY, Jimmy",10,106,2,3.3333333333333335,"X",15,15]
[16,124,"Unused Pegs 2",0,0,0,0,"",16,16]
[17,"","","","","","","","",""]
[18,"","","","","","","","",""]
[19,"","","","","","","","",""]
[20,"","","","","","","","",""]
[21,"","","","","","","","",""]
[22,"","","","","","","","",""]
[23,"","","","","","","","",""]
[24,"","","","","","","","",""]
[25,"","","","","","","","",""]
[26,"","","","","","","","",""]
[27,"","","","","","","","",""]
[28,"","","","","","","","",""]

{"sheet":"Pairs list","index":13,"n_rows":60,"n_cols":7,"rows_kept":60,"cut":false,"hidden":false,"merged":[]}
["Pair No","Pair Names","Partner 1 Name","Partner 2 Name","Partner 1 No.","Partner 2 No.","Pair No"]
[1,"WALES, Joe & THORNTON, Lee","WALES, Joe","THORNTON, Lee",118,112,1]
[2,"BOND, Darren & HAZELGROVE, Gary","BOND, Darren","HAZELGROVE, Gary",13,53,2]
[3,"ROGERS, Mark & DAWBER, Simon","ROGERS, Mark","DAWBER, Simon",95,31,3]
[4,"ROYALL, Tony  & MARTLAND, Kev","ROYALL, Tony ","MARTLAND, Kev",97,73,4]
[5,"FALK, Dave & SMART, Neil","FALK, Dave","SMART, Neil",39,103,5]
[6,"RUSSELL, Shane & FRARY, June","RUSSELL, Shane","FRARY, June",98,41,6]
[7,"CROSBY, Ralf & HUTSON, Garry","CROSBY, Ralf","HUTSON, Garry",29,60,7]
[8,"TUCK, Rob & KNIGHT, Simon","TUCK, Rob","KNIGHT, Simon",116,64,8]
[9,"BURT, Richard & ADAMS, Graham","BURT, Richard","ADAMS, Graham",20,1,9]
[10,"SMITH, George & HENNEY, Jimmy","SMITH, George","HENNEY, Jimmy",104,54,10]
[11,"WRIGHT, Dave & HURCOMBE, Mark","WRIGHT, Dave","HURCOMBE, Mark",123,58,11]
[12,"GOOCH, Mark & GASCOIGNE, Robert","GOOCH, Mark","GASCOIGNE, Robert",47,45,12]
[13,"ROPER, Liam & JOHNSON, Billy","ROPER, Liam","JOHNSON, Billy",96,61,13]
[14,"DOY, Alan & KIMBLE, John","DOY, Alan","KIMBLE, John",35,62,14]
[15,"NANGLE, Karl & CREASEY, Shaun","NANGLE, Karl","CREASEY, Shaun",78,27,15]
[16,"DENHOLM, Paul & BOTEZATO, Constantin","DENHOLM, Paul","BOTEZATO, Constantin",32,15,16]
[17,"DRAYTON, Simon & HIPPERSON, Richard","DRAYTON, Simon","HIPPERSON, Richard",36,57,17]
[18,"GARDINER, Gareth & DIAPER, Barry","GARDINER, Gareth","DIAPER, Barry",44,33,18]
[19,"LAY-FLURRIE, Matt & PRICE, Ben","LAY-FLURRIE, Matt","PRICE, Ben",66,91,19]
[20,"PLUMSTEAD, Joe & BANCROFT, Dave","PLUMSTEAD, Joe","BANCROFT, Dave",89,9,20]
[21,"FRENCH, Julian & AUSTIN, John","FRENCH, Julian","AUSTIN, John",42,7,21]
[22,"WOOD, Gary & HADDOCK, Roy","WOOD, Gary","HADDOCK, Roy",124,49,22]
[23,"RYDER, Edde & BALL, Keith","RYDER, Edde","BALL, Keith",99,8,23]
[24,"McCOY, Kenny & PEMBERTON, Andy","McCOY, Kenny","PEMBERTON, Andy",74,86,24]
[25,"EDWARDS, Lee & LILL, Jarrod","EDWARDS, Lee","LILL, Jarrod",37,70,25]
[26,"CROSBY, Colin & COOPER, Sam","CROSBY, Colin","COOPER, Sam",28,25,26]
[27,"LEE, Martin & SMITH, Leon","LEE, Martin","SMITH, Leon",68,105,27]
[28,"BUY, Craig & NICHOLSON, Steven","BUY, Craig","NICHOLSON, Steven",21,80,28]
[29,"MOORING, Luke & BROCK, Peter","MOORING, Luke","BROCK, Peter",76,17,29]
[30,"ARCH, Joe & CLEMENT, Alby","ARCH, Joe","CLEMENT, Alby",6,23,30]
[31,"ELLIOTT, Nathan & HARVEY, Paul ","ELLIOTT, Nathan","HARVEY, Paul ",38,52,31]
[32,"SHORTHOUSE, Dave & AKESTER, Jack","SHORTHOUSE, Dave","AKESTER, Jack",102,3,32]
[33,"YALLOP, Oliver & STORER, Paul","YALLOP, Oliver","STORER, Paul",125,109,33]
[34,"ADAMS, Stephen & PARKER, Gavin","ADAMS, Stephen","PARKER, Gavin",2,84,34]
[35,"WELLS, Thomas & LEE, Louise","WELLS, Thomas","LEE, Louise",120,67,35]
[36,"CARTER, John & PEARCE, Vic","CARTER, John","PEARCE, Vic",22,85,36]
[37,"HUTCHINSON, Dave & PRICE, Alan","HUTCHINSON, Dave","PRICE, Alan",59,90,37]
[38,"TAYLOR, Mark & HARRISON, Paul","TAYLOR, Mark","HARRISON, Paul",110,51,38]
[39,"ROBERTS, Steve & PARKER, Al","ROBERTS, Steve","PARKER, Al",94,82,39]
[40,"PAGE, Saul & HANCOX, Karen","PAGE, Saul","HANCOX, Karen",81,50,40]
[41,"McGILLOWAY, Wayne & SELF, Bevan","McGILLOWAY, Wayne","SELF, Bevan",75,100,41]
[42,"SPALL, Chris & BORDIANU, Adrian","SPALL, Chris","BORDIANU, Adrian",107,14,42]
[43,"PERRY, Joe & WICKS, Maralyn","PERRY, Joe","WICKS, Maralyn",87,122,43]
[44,"THORPE, Doug & BETTINSON, Charles","THORPE, Doug","BETTINSON, Charles",113,12,44]
[45,"ALDOUS, David & STEBBINGS, Robert","ALDOUS, David","STEBBINGS, Robert",5,108,45]
[46,"SERBAN, Nelu & TOPPING, Jack","SERBAN, Nelu","TOPPING, Jack",101,114,46]
[47,"PRICE, Jimmy & BANHAM, Jason","PRICE, Jimmy","BANHAM, Jason",92,10,47]
[48,"COTTER, Brett & KINGDON, Adam","COTTER, Brett","KINGDON, Adam",26,63,48]
[49,"GREEN, Kevin & DIAPER, Greg","GREEN, Kevin","DIAPER, Greg",48,34,49]
[50,"TOPPING, Mike & GALLACHER, Andy","TOPPING, Mike","GALLACHER, Andy",115,43,50]
[51,"FRARY, Charlie & THOMAS, Tony","FRARY, Charlie","THOMAS, Tony",40,111,51]
[52,"PINDER, Mark & HIGHFIELD, Nik","PINDER, Mark","HIGHFIELD, Nik",88,55,52]
[53,"TURNER, Cameron & LINDFIELD, Bill","TURNER, Cameron","LINDFIELD, Bill",117,71,53]
[54,"COOPER, Phillip & NELSON, Ian","COOPER, Phillip","NELSON, Ian",24,79,54]
[55,"LEE, Phil & PARKER, Daniel","LEE, Phil","PARKER, Daniel",69,83,55]
[56,"PROVINS, Colin & LAMBERT, Ian","PROVINS, Colin","LAMBERT, Ian",93,65,56]
[57,"BOWELL, Ian & WATTS, Mike","BOWELL, Ian","WATTS, Mike",16,119,57]
[58,"CUTLER, Neil & WHITE, Alan","CUTLER, Neil","WHITE, Alan",30,121,58]
[59,"SMITH, Stephen & YALLOP, Stephen","SMITH, Stephen","YALLOP, Stephen",106,126,59]

{"sheet":"All Individuals Day 1 (ALL)","index":14,"n_rows":130,"n_cols":11,"rows_kept":130,"cut":false,"hidden":false,"merged":[[1,0,2,0],[0,0,0,4],[0,5,0,10],[1,1,2,1],[1,2,2,2],[1,9,2,9],[1,10,2,10],[1,3,2,3],[1,4,2,4],[1,5,2,5],[1,6,2,6]]}
["NORTH NORFOLK BASS FESTIVAL 2020-21",null,null,null,null,"Day 1 (All Fish)"]
["Individual No.","Angler Name","Angler No.","Zone","Peg","No. Fish","Fish Points","Weight",null,"Day 1 Points","Day 1 Position"]
[null,null,null,null,null,null,null,"lbs","oz"]
[1,"WALES, Joe",118,"A",4,15,448,9,5.333333333333333,1,1]
[2,"BOND, Darren",13,"D",63,20,439,9,2.3333333333333335,1,2]
[3,"ROGERS, Mark",95,"B",21,20,374,7,12.666666666666666,1,3]
[4,"BURT, Richard",20,"A",16,21,367,7,10.333333333333334,2,4]
[5,"ROYALL, Tony ",97,"H",123,16,335,6,15.666666666666666,1,5]
[6,"SMITH, George",104,"D",55,15,310,6,7.333333333333333,2,6]
[7,"WRIGHT, Dave",123,"H",113,11,247,5,2.3333333333333335,2,7]
[8,"DRAYTON, Simon",36,"D",62,17,243,5,1,3,8]
[9,"GARDINER, Gareth",44,"H",118,15,243,5,1,3,9]
[10,"GOOCH, Mark",47,"B",18,18,240,5,0,2,10]
[11,"LAY-FLURRIE, Matt",66,"A",12,15,236,4,14.666666666666666,3,11]
[12,"FALK, Dave",39,"G",99,19,226,4,11.333333333333334,1,12]
[13,"PLUMSTEAD, Joe",89,"B",20,16,221,4,9.6666666666666661,3,13]
[14,"EDWARDS, Lee",37,"B",17,16,217,4,8.3333333333333339,4,14]
[15,"CROSBY, Colin",28,"A",2,8,214,4,7.333333333333333,4,15]
[16,"YALLOP, Oliver",125,"A",3,7,213,4,7,5,16]
[17,"McGILLOWAY, Wayne",75,"A",6,7,197,4,1.6666666666666667,6,17]
[18,"RUSSELL, Shane",98,"E",72,10,194,4,0.66666666666666663,1,18]
[19,"LEE, Martin",68,"H",120,7,186,3,14,4,19]
[20,"CROSBY, Ralf",29,"F",86,7,184,3,13.333333333333334,1,20]
[21,"ADAMS, Stephen",2,"H",128,9,183,3,13,5,21]
[22,"ROPER, Liam",96,"G",107,5,182,3,12.666666666666666,2,22]
[23,"SPALL, Chris",107,"H",125,14,177,3,11,6,23]
[24,"GREEN, Kevin",48,"H",122,9,177,3,11,7,24]
[25,"DOY, Alan",35,"F",95,7,164,3,6.666666666666667,2,25]
[26,"BUY, Craig",21,"D",49,10,160,3,5.333333333333333,4,26]
[27,"TUCK, Rob",116,"C",42,13,157,3,4.333333333333333,1,27]
[28,"NANGLE, Karl",78,"E",69,10,154,3,3.3333333333333335,2,28]
[29,"WELLS, Thomas",120,"D",52,9,149,3,1.6666666666666667,5,29]
[30,"DENHOLM, Paul",32,"C",38,10,144,3,0,2,30]
[31,"TOPPING, Mike",115,"A",14,8,140,2,14.666666666666666,7,31]
[32,"BOWELL, Ian",16,"A",15,12,137,2,13.666666666666666,8,32]
[33,"TOPPING, Jack",114,"A",13,7,135,2,13,9,33]
[34,"FRENCH, Julian",42,"E",79,11,134,2,12.666666666666666,3,34]
[35,"WOOD, Gary",124,"G",105,9,130,2,11.333333333333334,3,35]
[36,"MOORING, Luke",76,"G",111,11,124,2,9.3333333333333339,4,36]
[37,"CARTER, John",22,"B",26,8,123,2,9,5,37]
[38,"RYDER, Edde",99,"F",87,7,122,2,8.6666666666666661,3,38]
[39,"HUTCHINSON, Dave",59,"G",102,11,118,2,7.333333333333333,5,39]
[40,"PERRY, Joe",87,"G",108,6,118,2,7.333333333333333,6,40]
[41,"CUTLER, Neil",30,"H",127,9,115,2,6.333333333333333,8,41]
[42,"THORPE, Doug",113,"B",19,9,110,2,4.666666666666667,6,42]
[43,"HIPPERSON, Richard",57,"A",7,7,110,2,4.666666666666667,10,43]
[44,"FRARY, Charlie",40,"B",27,6,104,2,2.6666666666666665,7,44]
[45,"McCOY, Kenny",74,"C",43,10,103,2,2.3333333333333335,3,45]
[46,"ARCH, Joe",6,"C",39,8,101,2,1.6666666666666667,4,46]
[47,"GALLACHER, Andy",43,"A",11,7,99,2,1,11,47]
[48,"ELLIOTT, Nathan",38,"E",65,8,98,2,0.66666666666666663,4,48]
[49,"SHORTHOUSE, Dave",102,"F",83,8,97,2,0.33333333333333331,4,49]
[50,"TAYLOR, Mark",110,"F",84,8,94,1,15.333333333333334,5,50]
[51,"ALDOUS, David",5,"F",93,8,93,1,15,6,51]
[52,"ROBERTS, Steve",94,"E",68,5,91,1,14.333333333333334,5,52]
[53,"PINDER, Mark",88,"F",96,6,90,1,14,7,53]
[54,"SERBAN, Nelu",101,"D",50,3,90,1,14,6,54]
[55,"PRICE, Jimmy",92,"E",66,8,89,1,13.666666666666666,6,55]
[56,"TURNER, Cameron",117,"E",71,7,89,1,13.666666666666666,7,56]
[57,"SMITH, Stephen",106,"F",88,8,85,1,12.333333333333334,8,57]
[58,"COOPER, Phillip",24,"D",54,6,85,1,12.333333333333334,7,58]
[59,"STEBBINGS, Robert",108,"A",8,9,84,1,12,12,59]
[60,"WATTS, Mike",119,"D",61,8,84,1,12,8,60]
[61,"KNIGHT, Simon",64,"H",121,7,81,1,11,9,61]
[62,"PAGE, Saul",81,"C",46,7,80,1,10.666666666666666,5,62]
[63,"HUTSON, Garry",60,"D",53,6,79,1,10.333333333333334,9,63]
[64,"PARKER, Daniel",83,"E",80,6,77,1,9.6666666666666661,8,64]
[65,"JOHNSON, Billy",61,"A",5,3,75,1,9,13,65]
[66,"LAMBERT, Ian",65,"E",67,2,74,1,8.6666666666666661,9,66]
[67,"COTTER, Brett",26,"C",45,4,73,1,8.3333333333333339,6,67]
[68,"PRICE, Alan",90,"E",77,6,68,1,6.666666666666667,10,68]
[69,"LEE, Phil",69,"C",33,6,66,1,6,7,69]
[70,"PEMBERTON, Andy",86,"H",117,5,66,1,6,10,70]
[71,"BANHAM, Jason",10,"H",114,6,65,1,5.666666666666667,11,71]
[72,"PROVINS, Colin",93,"G",110,6,63,1,5,7,72]
[73,"HARRISON, Paul",51,"E",78,5,63,1,5,11,73]
[74,"NICHOLSON, Steven",80,"G",104,5,62,1,4.666666666666667,8,74]
[75,"WHITE, Alan",121,"F",81,6,61,1,4.333333333333333,9,75]
[76,"BANCROFT, Dave",9,"B",23,5,60,1,4,8,76]
[77,"WICKS, Maralyn",122,"G",112,2,60,1,4,9,77]
[78,"DIAPER, Barry",33,"D",60,5,59,1,3.6666666666666665,10,78]
[79,"GASCOIGNE, Robert",45,"G",98,7,58,1,3.3333333333333335,10,79]
[80,"PRICE, Ben",91,"F",85,5,58,1,3.3333333333333335,10,80]
[81,"NELSON, Ian",79,"E",73,2,58,1,3.3333333333333335,12,81]
[82,"THORNTON, Lee",112,"D",56,5,53,1,1.6666666666666667,11,82]
[83,"HIGHFIELD, Nik",55,"A",9,4,53,1,1.6666666666666667,14,83]
[84,"HAZELGROVE, Gary",53,"G",103,4,48,1,0,11,84]
[85,"COOPER, Sam",25,"A",10,3,48,1,0,15,85]
[86,"PARKER, Gavin",84,"F",90,4,46,0,15.333333333333334,11,86]
[87,"BORDIANU, Adrian",14,"F",91,4,46,0,15.333333333333334,11,86]
[88,"PEARCE, Vic",85,"G",106,4,45,0,15,12,88]
[89,"BROWN, Kay",18,"B",24,1,44,0,14.666666666666666,9,89]
[90,"LINDFIELD, Bill",71,"D",59,5,42,0,14,12,90]
[91,"KINGDON, Adam",63,"E",70,3,37,0,12.333333333333334,13,91]
[92,"ADAMS, Graham",1,"G",101,3,35,0,11.666666666666666,13,92]
[93,"SELF, Bevan",100,"G",100,3,34,0,11.333333333333334,14,93]
[94,"THOMAS, Tony",111,"C",37,3,33,0,11,8,94]
[95,"CLEMENT, Alby",23,"C",41,3,31,0,10.333333333333334,9,95]
[96,"LINDFIELD, Heather",72,"B",31,2,31,0,10.333333333333334,10,96]
[97,"AKESTER, Jack",3,"B",22,3,27,0,9,11,97]
[98,"DAWBER, Simon",31,"C",35,2,27,0,9,10,98]
[99,"MARTLAND, Kev",73,"E",75,2,26,0,8.6666666666666661,14,99]
[100,"AUSTIN, John",7,"D",51,3,25,0,8.3333333333333339,13,100]
[101,"PARKER, Al",82,"F",92,2,25,0,8.3333333333333339,13,101]
[102,"YALLOP, Stephen",126,"B",32,2,23,0,7.666666666666667,12,102]
[103,"DIAPER, Greg",34,"D",58,2,21,0,7,14,103]
[104,"BALL, Keith",8,"G",97,2,21,0,7,15,103]
[105,"HADDOCK, Roy",49,"C",47,2,20,0,6.666666666666667,11,105]
[106,"BOTEZATO, Constantin",15,"H",116,2,18,0,6,12,106]
[107,"SMART, Neil",103,"F",82,2,16,0,5.333333333333333,14,107]
[108,"BANHAM, Mark",11,"H",115,1,16,0,5.333333333333333,13,108]
[109,"CREASEY, Shaun",27,"H",126,1,16,0,5.333333333333333,13,108]
[110,"METCALFE, Wendy",19,"B",25,1,13,0,4.333333333333333,13,110]
[111,"HARVEY, Paul ",52,"E",74,1,12,0,4,15,111]
[112,"ALDOUS, Brayden",4,"F",94,1,12,0,4,15,111]
[113,"BETTINSON, Charles",12,"D",64,1,7,0,2.3333333333333335,15,113]
[114,"FRARY, June",41,"B",28,0,0,0,0,16,114]
[115,"HANCOX, Karen",50,"B",29,0,0,0,0,16,114]
[116,"HENNEY, Jimmy",54,"B",30,0,0,0,0,16,114]
[117,"HILLS, Amy",56,"C",34,0,0,0,0,16,114]
[118,"MURRAY, Luke (DID NOT FISH)",77,"C",36,0,0,0,0,16,114]
[119,"LILL, Jarrod",70,"C",40,0,0,0,0,16,114]
[120,"HURCOMBE, Mark",58,"C",44,0,0,0,0,16,114]
[121,"Unused Pegs 1",127,"C",48,0,0,0,0,16,114]
[122,"SMITH, Leon",105,"D",57,0,0,0,0,16,114]
[123,"GIBBS, Tom (DID NOT FISH)",46,"E",76,0,0,0,0,16,114]
[124,"STORER, Paul",109,"F",89,0,0,0,0,16,114]
[125,"KIMBLE, John",62,"G",109,0,0,0,0,16,114]
[126,"LEE, Louise",67,"H",119,0,0,0,0,16,114]
[127,"BROCK, Peter",17,"H",124,0,0,0,0,16,114]

{"sheet":"All Individuals Day 2 (ALL)","index":15,"n_rows":129,"n_cols":11,"rows_kept":129,"cut":false,"hidden":false,"merged":[[0,0,0,4],[0,5,0,10],[1,0,2,0],[1,1,2,1],[1,2,2,2],[1,3,2,3],[1,4,2,4],[1,5,2,5],[1,6,2,6],[1,9,2,9],[1,10,2,10]]}
["NORTH NORFOLK BASS FESTIVAL 2020-21",null,null,null,null,"Day 2 (All Fish)"]
["Individual No.","Angler Name","Angler No.","Zone","Peg","No. Fish","Fish Points","Weight",null,"Day 2 Points","Day 2 Position"]
[null,null,null,null,null,null,null,"lbs","oz"]
[1,"TUCK, Rob",116,"E",77,23,868,18,1.3333333333333333,1,1]
[2,"GARDINER, Gareth",44,"A",1,23,754,15,11.333333333333334,1,2]
[3,"SHORTHOUSE, Dave",102,"A",12,34,651,13,9,2,3]
[4,"CROSBY, Ralf",29,"A",13,41,624,13,0,3,4]
[5,"ADAMS, Graham",1,"B",20,36,611,12,11.666666666666666,1,5]
[6,"BOND, Darren",13,"H",127,54,583,12,2.3333333333333335,1,6]
[7,"SMITH, George",104,"H",128,47,572,11,14.666666666666666,2,7]
[8,"ADAMS, Stephen",2,"D",51,16,557,11,9.6666666666666661,1,8]
[9,"FALK, Dave",39,"B",32,37,539,11,3.6666666666666665,2,9]
[10,"TAYLOR, Mark",110,"A",8,25,531,11,1,4,10]
[11,"CROSBY, Colin",28,"H",121,44,522,10,14,3,11]
[12,"ROGERS, Mark",95,"G",99,46,504,10,8,1,12]
[13,"NANGLE, Karl",78,"B",18,27,502,10,7.333333333333333,3,13]
[14,"PRICE, Ben",91,"C",41,20,502,10,7.333333333333333,1,14]
[15,"MOORING, Luke",76,"D",62,27,500,10,6.666666666666667,2,15]
[16,"PERRY, Joe",87,"B",25,35,499,10,6.333333333333333,4,16]
[17,"RUSSELL, Shane",98,"D",58,16,484,10,1.3333333333333333,3,17]
[18,"LINDFIELD, Bill",71,"F",95,37,479,9,15.666666666666666,1,18]
[19,"WRIGHT, Dave",123,"B",27,22,475,9,14.333333333333334,5,19]
[20,"TURNER, Cameron",117,"C",37,22,447,9,5,2,20]
[21,"GALLACHER, Andy",43,"H",119,46,438,9,2,4,21]
[22,"GOOCH, Mark",47,"F",82,32,438,9,2,2,22]
[23,"PINDER, Mark",88,"D",60,18,436,9,1.3333333333333333,4,23]
[24,"WATTS, Mike",119,"G",103,42,435,9,1,2,24]
[25,"ELLIOTT, Nathan",38,"D",64,29,415,8,10.333333333333334,5,25]
[26,"PAGE, Saul",81,"E",66,37,404,8,6.666666666666667,2,26]
[27,"THORPE, Doug",113,"H",123,36,398,8,4.666666666666667,5,27]
[28,"BURT, Richard",20,"F",88,33,393,8,3,3,28]
[29,"BUY, Craig",21,"H",122,29,386,8,0.66666666666666663,6,29]
[30,"YALLOP, Stephen",126,"G",100,36,367,7,10.333333333333334,3,30]
[31,"BALL, Keith",8,"A",11,25,365,7,9.6666666666666661,5,31]
[32,"WOOD, Gary",124,"B",31,23,356,7,6.666666666666667,6,32]
[33,"McCOY, Kenny",74,"F",81,17,356,7,6.666666666666667,4,33]
[34,"McGILLOWAY, Wayne",75,"H",117,32,351,7,5,7,34]
[35,"CUTLER, Neil",30,"C",40,22,351,7,5,3,35]
[36,"FRENCH, Julian",42,"B",24,29,347,7,3.6666666666666665,7,36]
[37,"GASCOIGNE, Robert",45,"A",9,24,344,7,2.6666666666666665,6,37]
[38,"HUTSON, Garry",60,"H",126,31,339,7,1,8,38]
[39,"LEE, Martin",68,"B",17,22,336,7,0,8,39]
[40,"ARCH, Joe",6,"G",97,32,325,6,12.333333333333334,4,40]
[41,"PROVINS, Colin",93,"B",30,28,323,6,11.666666666666666,9,41]
[42,"SMITH, Leon",105,"H",125,30,319,6,10.333333333333334,9,42]
[43,"PRICE, Alan",90,"C",47,9,313,6,8.3333333333333339,4,43]
[44,"CLEMENT, Alby",23,"F",93,30,302,6,4.666666666666667,5,44]
[45,"SERBAN, Nelu",101,"F",92,25,298,6,3.3333333333333335,6,45]
[46,"SPALL, Chris",107,"A",4,30,294,6,2,7,46]
[47,"SELF, Bevan",100,"C",33,20,288,6,0,5,47]
[48,"PLUMSTEAD, Joe",89,"H",115,26,284,5,14.666666666666666,10,48]
[49,"HARRISON, Paul",51,"A",2,17,283,5,14.333333333333334,8,49]
[50,"BANHAM, Jason",10,"A",6,22,275,5,11.666666666666666,9,50]
[51,"AKESTER, Jack",3,"G",102,29,271,5,10.333333333333334,5,51]
[52,"PRICE, Jimmy",92,"A",15,18,269,5,9.6666666666666661,10,52]
[53,"WICKS, Maralyn",122,"B",26,18,265,5,8.3333333333333339,10,53]
[54,"KIMBLE, John",62,"B",19,20,260,5,6.666666666666667,11,54]
[55,"STEBBINGS, Robert",108,"F",83,18,258,5,6,7,55]
[56,"THORNTON, Lee",112,"F",94,22,254,5,4.666666666666667,8,56]
[57,"BORDIANU, Adrian",14,"C",38,17,253,5,4.333333333333333,6,57]
[58,"RYDER, Edde",99,"D",49,14,253,5,4.333333333333333,6,58]
[59,"DIAPER, Barry",33,"E",67,21,252,5,4,3,59]
[60,"FRARY, Charlie",40,"G",112,23,249,5,3,6,60]
[61,"HIPPERSON, Richard",57,"G",108,22,249,5,3,7,61]
[62,"ROBERTS, Steve",94,"A",14,14,249,5,3,11,62]
[63,"PEMBERTON, Andy",86,"A",5,20,239,4,15.666666666666666,12,63]
[64,"WELLS, Thomas",120,"F",91,18,239,4,15.666666666666666,9,64]
[65,"PEARCE, Vic",85,"B",21,19,238,4,15.333333333333334,12,65]
[66,"SMART, Neil",103,"A",3,20,234,4,14,13,66]
[67,"COOPER, Sam",25,"E",65,18,229,4,12.333333333333334,4,67]
[68,"LAY-FLURRIE, Matt",66,"E",76,18,222,4,10,5,68]
[69,"TOPPING, Mike",115,"F",87,22,221,4,9.6666666666666661,10,69]
[70,"HUTCHINSON, Dave",59,"B",22,20,221,4,9.6666666666666661,13,70]
[71,"EDWARDS, Lee",37,"F",85,16,219,4,9,11,71]
[72,"DENHOLM, Paul",32,"E",80,18,216,4,8,6,72]
[73,"MARTLAND, Kev",73,"A",10,18,214,4,7.333333333333333,14,73]
[74,"COOPER, Phillip",24,"F",89,17,210,4,6,12,74]
[75,"NELSON, Ian",79,"D",59,16,210,4,6,7,75]
[76,"COTTER, Brett",26,"E",73,11,210,4,6,7,76]
[77,"LILL, Jarrod",70,"G",111,18,202,4,3.3333333333333335,8,77]
[78,"NICHOLSON, Steven",80,"B",23,8,201,4,3,14,78]
[79,"DOY, Alan",35,"C",39,9,198,4,2,7,79]
[80,"LINDFIELD, Heather",72,"G",104,20,194,4,0.66666666666666663,9,80]
[81,"SMITH, Stephen",106,"D",53,12,190,3,15.333333333333334,8,81]
[82,"DRAYTON, Simon",36,"F",84,19,186,3,14,13,82]
[83,"LEE, Phil",69,"E",71,18,185,3,13.666666666666666,8,83]
[84,"AUSTIN, John",7,"E",74,10,185,3,13.666666666666666,9,84]
[85,"GREEN, Kevin",48,"D",61,16,183,3,13,9,85]
[86,"DAWBER, Simon",31,"E",69,15,181,3,12.333333333333334,10,86]
[87,"LEE, Louise",67,"A",16,12,179,3,11.666666666666666,15,87]
[88,"ROYALL, Tony ",97,"D",63,12,177,3,11,10,88]
[89,"BOWELL, Ian",16,"E",75,19,173,3,9.6666666666666661,11,89]
[90,"WALES, Joe",118,"H",114,17,172,3,9.3333333333333339,11,90]
[91,"BROWN, Kay",18,"G",106,16,160,3,5.333333333333333,10,91]
[92,"METCALFE, Wendy",19,"G",107,13,155,3,3.6666666666666665,11,92]
[93,"HAZELGROVE, Gary",53,"D",55,12,151,3,2.3333333333333335,11,93]
[94,"BANHAM, Mark",11,"A",7,9,151,3,2.3333333333333335,16,94]
[95,"CARTER, John",22,"G",110,17,148,3,1.3333333333333333,12,95]
[96,"KINGDON, Adam",63,"C",48,8,147,3,1,8,96]
[97,"DIAPER, Greg",34,"G",105,13,144,3,0,13,97]
[98,"FRARY, June",41,"H",113,16,141,2,15,12,98]
[99,"HANCOX, Karen",50,"H",116,17,137,2,13.666666666666666,13,99]
[100,"TOPPING, Jack",114,"F",86,14,134,2,12.666666666666666,14,100]
[101,"THOMAS, Tony",111,"E",68,7,133,2,12.333333333333334,12,101]
[102,"HIGHFIELD, Nik",55,"E",78,11,120,2,8,13,102]
[103,"ALDOUS, David",5,"B",28,12,119,2,7.666666666666667,15,103]
[104,"STORER, Paul",109,"C",35,9,115,2,6.333333333333333,9,104]
[105,"JOHNSON, Billy",61,"E",72,13,112,2,5.333333333333333,14,105]
[106,"BOTEZATO, Constantin",15,"D",56,11,112,2,5.333333333333333,12,106]
[107,"CREASEY, Shaun",27,"C",42,2,112,2,5.333333333333333,10,107]
[108,"HADDOCK, Roy",49,"H",120,11,107,2,3.6666666666666665,14,108]
[109,"BETTINSON, Charles",12,"G",98,13,106,2,3.3333333333333335,14,109]
[110,"HENNEY, Jimmy",54,"H",118,10,106,2,3.3333333333333335,15,110]
[111,"PARKER, Daniel",83,"D",57,7,97,2,0.33333333333333331,13,111]
[112,"BANCROFT, Dave",9,"G",109,8,77,1,9.6666666666666661,15,112]
[113,"YALLOP, Oliver",125,"F",90,7,77,1,9.6666666666666661,15,113]
[114,"ALDOUS, Brayden",4,"B",29,6,77,1,9.6666666666666661,16,114]
[115,"WHITE, Alan",121,"D",52,6,72,1,8,14,115]
[116,"KNIGHT, Simon",64,"D",50,5,68,1,6.666666666666667,15,116]
[117,"PARKER, Gavin",84,"C",46,3,34,0,11.333333333333334,11,117]
[118,"HARVEY, Paul ",52,"C",44,3,30,0,10,12,118]
[119,"LAMBERT, Ian",65,"C",36,2,24,0,8,13,119]
[120,"PARKER, Al",82,"C",45,1,14,0,4.666666666666667,14,120]
[121,"BROCK, Peter",17,"C",34,0,0,0,0,16,121]
[122,"GIBBS, Tom (DID NOT FISH)",46,"C",43,0,0,0,0,16,121]
[123,"ROPER, Liam",96,"D",54,0,0,0,0,16,121]
[125,"HILLS, Amy",56,"E",79,0,0,0,0,16,121]
[126,"HURCOMBE, Mark",58,"F",96,0,0,0,0,16,121]
[127,"MURRAY, Luke (DID NOT FISH)",77,"G",101,0,0,0,0,16,121]

{"sheet":"Bass Festival Day 1 (Bass)","index":16,"n_rows":30,"n_cols":10,"rows_kept":30,"cut":false,"hidden":false,"merged":[[1,9,2,9],[0,0,0,4],[0,5,0,9],[1,0,2,0],[1,1,2,1],[1,2,2,2],[1,3,2,3],[1,4,2,4],[1,5,2,5],[1,6,2,6]]}
["NORTH NORFOLK BASS FESTIVAL 2020-21",null,null,null,null,"Day 1 (Bass)"]
["Individual No.","Angler Name","Angler No.","Zone","Peg","No. Fish","Fish Points","Weight",null,"Day 1 Position"]
[null,null,null,null,null,null,null,"lbs","oz"]
[1,"WALES, Joe",118,"A",4,3,216,4,8,1]
[2,"ROGERS, Mark",95,"B",21,2,184,3,13.333333333333334,2]
[3,"ROYALL, Tony ",97,"H",123,1,158,3,4.666666666666667,3]
[4,"BOND, Darren",13,"D",63,2,151,3,2.3333333333333335,4]
[5,"McGILLOWAY, Wayne",75,"A",6,2,135,2,13,5]
[6,"ROPER, Liam",96,"G",107,1,129,2,11,6]
[7,"YALLOP, Oliver",125,"A",3,2,124,2,9.3333333333333339,7]
[8,"BURT, Richard",20,"A",16,2,119,2,7.666666666666667,8]
[9,"SMITH, George",104,"D",55,1,116,2,6.666666666666667,9]
[10,"DOY, Alan",35,"F",95,1,116,2,6.666666666666667,9]
[11,"RUSSELL, Shane",98,"E",72,1,110,2,4.666666666666667,11]
[12,"LEE, Martin",68,"H",120,1,98,2,0.66666666666666663,12]
[13,"CROSBY, Ralf",29,"F",86,1,92,1,14.666666666666666,13]
[14,"WRIGHT, Dave",123,"H",113,1,92,1,14.666666666666666,13]
[15,"SERBAN, Nelu",101,"D",50,1,68,1,6.666666666666667,15]
[16,"LAMBERT, Ian",65,"E",67,1,68,1,6.666666666666667,15]
[17,"ADAMS, Stephen",2,"H",128,1,68,1,6.666666666666667,15]
[18,"WELLS, Thomas",120,"D",52,1,63,1,5,18]
[19,"WICKS, Maralyn",122,"G",112,1,55,1,2.3333333333333335,19]
[20,"TOPPING, Jack",114,"A",13,1,51,1,1,20]
[21,"BUY, Craig",21,"D",49,1,51,1,1,20]
[22,"NELSON, Ian",79,"E",73,1,51,1,1,20]
[23,"LAY-FLURRIE, Matt",66,"A",12,1,47,0,15.666666666666666,23]
[24,"RYDER, Edde",99,"F",87,1,47,0,15.666666666666666,23]
[25,"GOOCH, Mark",47,"B",18,1,43,0,14.333333333333334,25]
[26,"GREEN, Kevin",48,"H",122,1,40,0,13.333333333333334,26]
[27,"DENHOLM, Paul",32,"C",38,1,37,0,12.333333333333334,27]

{"sheet":"Bass Festival Day 2 (Bass)","index":17,"n_rows":11,"n_cols":10,"rows_kept":11,"cut":false,"hidden":false,"merged":[[1,9,2,9],[0,5,0,9],[1,5,2,5],[1,6,2,6],[0,0,0,4],[1,0,2,0],[1,1,2,1],[1,2,2,2],[1,3,2,3],[1,4,2,4]]}
["NORTH NORFOLK BASS FESTIVAL 2020-21",null,null,null,null,"Day 2 (Bass)"]
["Individual No.","Angler Name","Angler No.","Zone","Peg","No. Fish","Fish Points","Weight",null,"Day 2 Position"]
[null,null,null,null,null,null,null,"lbs","oz"]
[1,"TAYLOR, Mark",110,"A",8,2,159,3,5,1]
[2,"McCOY, Kenny",74,"F",81,1,122,2,8.6666666666666661,2]
[3,"WOOD, Gary",124,"B",31,1,116,2,6.666666666666667,3]
[4,"WRIGHT, Dave",123,"B",27,2,98,2,0.66666666666666663,4]
[5,"NANGLE, Karl",78,"B",18,1,74,1,8.6666666666666661,5]
[6,"GARDINER, Gareth",44,"A",1,1,47,0,15.666666666666666,6]
[7,"FRENCH, Julian",42,"B",24,1,16,0,5.333333333333333,7]
[8,"SELF, Bevan",100,"C",33,1,16,0,5.333333333333333,7]

{"sheet":"Bass Festival Day 1 (Flattie)","index":18,"n_rows":93,"n_cols":10,"rows_kept":93,"cut":false,"hidden":false,"merged":[[1,9,2,9],[0,0,0,4],[0,5,0,9],[1,0,2,0],[1,1,2,1],[1,2,2,2],[1,3,2,3],[1,4,2,4],[1,5,2,5],[1,6,2,6]]}
["NORTH NORFOLK BASS FESTIVAL 2020-21",null,null,null,null,"Day 1 (Flattie)"]
["Individual No.","Angler Name","Angler No.","Zone","Peg","No. Fish","Fish Points","Weight",null,"Day 1 Position"]
[null,null,null,null,null,null,null,"lbs","oz"]
[1,"CROSBY, Colin",28,"A",2,8,214,4,7.333333333333333,1]
[2,"WALES, Joe",118,"A",4,9,184,3,13.333333333333334,2]
[3,"DRAYTON, Simon",36,"D",62,10,172,3,9.3333333333333339,3]
[4,"GOOCH, Mark",47,"B",18,15,165,3,7,4]
[5,"PLUMSTEAD, Joe",89,"B",20,12,163,3,6.333333333333333,5]
[6,"ROYALL, Tony ",97,"H",123,13,157,3,4.333333333333333,6]
[7,"LAY-FLURRIE, Matt",66,"A",12,11,142,2,15.333333333333334,7]
[8,"BURT, Richard",20,"A",16,11,139,2,14.333333333333334,8]
[9,"GARDINER, Gareth",44,"H",118,6,139,2,14.333333333333334,9]
[10,"TOPPING, Mike",115,"A",14,6,124,2,9.3333333333333339,10]
[11,"EDWARDS, Lee",37,"B",17,7,96,2,0,11]
[12,"GREEN, Kevin",48,"H",122,4,93,1,15,12]
[13,"ROGERS, Mark",95,"B",21,9,92,1,14.666666666666666,13]
[14,"THORPE, Doug",113,"B",19,7,89,1,13.666666666666666,14]
[15,"YALLOP, Oliver",125,"A",3,5,89,1,13.666666666666666,15]
[16,"BOWELL, Ian",16,"A",15,7,83,1,11.666666666666666,16]
[17,"GALLACHER, Andy",43,"A",11,6,81,1,11,17]
[18,"BOND, Darren",13,"D",63,7,79,1,10.333333333333334,18]
[19,"CARTER, John",22,"B",26,4,77,1,9.6666666666666661,19]
[20,"PINDER, Mark",88,"F",96,4,74,1,8.6666666666666661,20]
[21,"SPALL, Chris",107,"H",125,6,73,1,8.3333333333333339,21]
[22,"WOOD, Gary",124,"G",105,4,72,1,8,22]
[23,"JOHNSON, Billy",61,"A",5,2,67,1,6.333333333333333,23]
[24,"CUTLER, Neil",30,"H",127,5,62,1,4.666666666666667,24]
[25,"STEBBINGS, Robert",108,"A",8,7,60,1,4,25]
[26,"ALDOUS, David",5,"F",93,5,60,1,4,26]
[27,"MOORING, Luke",76,"G",111,5,60,1,4,26]
[28,"TOPPING, Jack",114,"A",13,4,56,1,2.6666666666666665,28]
[29,"TUCK, Rob",116,"C",42,5,55,1,2.3333333333333335,29]
[30,"NANGLE, Karl",78,"E",69,3,52,1,1.3333333333333333,30]
[31,"WATTS, Mike",119,"D",61,4,50,1,0.66666666666666663,31]
[32,"COOPER, Sam",25,"A",10,3,48,1,0,32]
[33,"COOPER, Phillip",24,"D",54,3,46,0,15.333333333333334,33]
[34,"ROBERTS, Steve",94,"E",68,1,44,0,14.666666666666666,34]
[35,"SMITH, Stephen",106,"F",88,4,43,0,14.333333333333334,35]
[36,"HUTSON, Garry",60,"D",53,2,42,0,14,36]
[37,"RYDER, Edde",99,"F",87,4,41,0,13.666666666666666,37]
[38,"WRIGHT, Dave",123,"H",113,5,40,0,13.333333333333334,38]
[39,"CROSBY, Ralf",29,"F",86,1,40,0,13.333333333333334,39]
[40,"SHORTHOUSE, Dave",102,"F",83,3,38,0,12.666666666666666,40]
[41,"FALK, Dave",39,"G",99,3,38,0,12.666666666666666,40]
[42,"HIPPERSON, Richard",57,"A",7,2,36,0,12,42]
[43,"ARCH, Joe",6,"C",39,4,35,0,11.666666666666666,43]
[44,"TURNER, Cameron",117,"E",71,2,35,0,11.666666666666666,44]
[45,"ELLIOTT, Nathan",38,"E",65,3,34,0,11.333333333333334,45]
[46,"BANHAM, Jason",10,"H",114,3,34,0,11.333333333333334,45]
[47,"THORNTON, Lee",112,"D",56,3,32,0,10.666666666666666,47]
[48,"WHITE, Alan",121,"F",81,3,31,0,10.333333333333334,48]
[49,"ROPER, Liam",96,"G",107,3,29,0,9.6666666666666661,49]
[50,"LEE, Phil",69,"C",33,3,28,0,9.3333333333333339,50]
[51,"HUTCHINSON, Dave",59,"G",102,3,28,0,9.3333333333333339,50]
[52,"PRICE, Jimmy",92,"E",66,2,28,0,9.3333333333333339,52]
[53,"NICHOLSON, Steven",80,"G",104,2,28,0,9.3333333333333339,52]
[54,"GASCOIGNE, Robert",45,"G",98,4,26,0,8.6666666666666661,54]
[55,"HIGHFIELD, Nik",55,"A",9,2,26,0,8.6666666666666661,55]
[56,"FRARY, Charlie",40,"B",27,2,26,0,8.6666666666666661,55]
[57,"SELF, Bevan",100,"G",100,2,26,0,8.6666666666666661,55]
[58,"McCOY, Kenny",74,"C",43,3,25,0,8.3333333333333339,58]
[59,"PROVINS, Colin",93,"G",110,3,25,0,8.3333333333333339,58]
[60,"HARRISON, Paul",51,"E",78,2,24,0,8,60]
[61,"RUSSELL, Shane",98,"E",72,3,23,0,7.666666666666667,61]
[62,"PERRY, Joe",87,"G",108,2,23,0,7.666666666666667,62]
[63,"PEMBERTON, Andy",86,"H",117,2,22,0,7.333333333333333,63]
[64,"LEE, Martin",68,"H",120,1,21,0,7,64]
[65,"McGILLOWAY, Wayne",75,"A",6,2,20,0,6.666666666666667,65]
[66,"HAZELGROVE, Gary",53,"G",103,2,20,0,6.666666666666667,65]
[67,"DOY, Alan",35,"F",95,3,19,0,6.333333333333333,67]
[68,"KINGDON, Adam",63,"E",70,2,19,0,6.333333333333333,68]
[69,"DAWBER, Simon",31,"C",35,1,18,0,6,69]
[70,"ADAMS, Stephen",2,"H",128,2,17,0,5.666666666666667,70]
[71,"PARKER, Daniel",83,"E",80,2,16,0,5.333333333333333,71]
[72,"BORDIANU, Adrian",14,"F",91,2,16,0,5.333333333333333,71]
[73,"BUY, Craig",21,"D",49,1,16,0,5.333333333333333,73]
[74,"ADAMS, Graham",1,"G",101,1,16,0,5.333333333333333,73]
[75,"PRICE, Ben",91,"F",85,2,15,0,5,75]
[76,"KNIGHT, Simon",64,"H",121,2,15,0,5,75]
[77,"WELLS, Thomas",120,"D",52,2,14,0,4.666666666666667,77]
[78,"LINDFIELD, Bill",71,"D",59,2,14,0,4.666666666666667,77]
[79,"PARKER, Al",82,"F",92,1,14,0,4.666666666666667,79]
[80,"MARTLAND, Kev",73,"E",75,1,12,0,4,80]
[81,"PRICE, Alan",90,"E",77,1,12,0,4,80]
[82,"BANCROFT, Dave",9,"B",23,1,10,0,3.3333333333333335,82]
[83,"BALL, Keith",8,"G",97,1,10,0,3.3333333333333335,82]
[84,"PARKER, Gavin",84,"F",90,1,8,0,2.6666666666666665,84]
[85,"THOMAS, Tony",111,"C",37,1,7,0,2.3333333333333335,85]
[86,"BETTINSON, Charles",12,"D",64,1,7,0,2.3333333333333335,85]
[87,"NELSON, Ian",79,"E",73,1,7,0,2.3333333333333335,85]
[88,"DENHOLM, Paul",32,"C",38,1,6,0,2,88]
[89,"FRENCH, Julian",42,"E",79,1,6,0,2,88]
[90,"WICKS, Maralyn",122,"G",112,1,5,0,1.6666666666666667,90]

{"sheet":"Bass Festival Day 2 (Flattie)","index":19,"n_rows":114,"n_cols":10,"rows_kept":114,"cut":false,"hidden":false,"merged":[[1,9,2,9],[0,5,0,9],[1,5,2,5],[1,6,2,6],[0,0,0,4],[1,0,2,0],[1,1,2,1],[1,2,2,2],[1,3,2,3],[1,4,2,4]]}
["NORTH NORFOLK BASS FESTIVAL 2020-21",null,null,null,null,"Day 2 (Flattie)"]
["Individual No.","Angler Name","Angler No.","Zone","Peg","No. Fish","Fish Points","Weight",null,"Day 2 Position"]
[null,null,null,null,null,null,null,"lbs","oz"]
[1,"ROGERS, Mark",95,"G",99,41,440,9,2.6666666666666665,1]
[2,"GOOCH, Mark",47,"F",82,31,424,8,13.333333333333334,2]
[3,"GALLACHER, Andy",43,"H",119,44,420,8,12,3]
[4,"BOND, Darren",13,"H",127,40,408,8,8,4]
[5,"SHORTHOUSE, Dave",102,"A",12,28,404,8,6.666666666666667,5]
[6,"CROSBY, Ralf",29,"A",13,33,402,8,6,6]
[7,"CROSBY, Colin",28,"H",121,34,389,8,1.6666666666666667,7]
[8,"PERRY, Joe",87,"B",25,25,376,7,13.333333333333334,8]
[9,"WATTS, Mike",119,"G",103,36,359,7,7.666666666666667,9]
[10,"YALLOP, Stephen",126,"G",100,33,318,6,10,10]
[11,"BUY, Craig",21,"H",122,24,316,6,9.3333333333333339,11]
[12,"SMITH, George",104,"H",128,26,310,6,7.333333333333333,12]
[13,"THORPE, Doug",113,"H",123,29,308,6,6.666666666666667,13]
[14,"ARCH, Joe",6,"G",97,30,294,6,2,14]
[15,"NANGLE, Karl",78,"B",18,21,291,6,1,15]
[16,"LINDFIELD, Bill",71,"F",95,26,281,5,13.666666666666666,16]
[17,"MOORING, Luke",76,"D",62,18,281,5,13.666666666666666,17]
[18,"FALK, Dave",39,"B",32,23,275,5,11.666666666666666,18]
[19,"CLEMENT, Alby",23,"F",93,27,274,5,11.333333333333334,19]
[20,"ADAMS, Graham",1,"B",20,23,262,5,7.333333333333333,20]
[21,"FRENCH, Julian",42,"B",24,21,262,5,7.333333333333333,21]
[22,"SPALL, Chris",107,"A",4,27,253,5,4.333333333333333,22]
[23,"PAGE, Saul",81,"E",66,23,250,5,3.3333333333333335,23]
[24,"BANHAM, Jason",10,"A",6,19,240,5,0,24]
[25,"BALL, Keith",8,"A",11,19,239,4,15.666666666666666,25]
[26,"PLUMSTEAD, Joe",89,"H",115,22,236,4,14.666666666666666,26]
[27,"BURT, Richard",20,"F",88,24,230,4,12.666666666666666,27]
[28,"TUCK, Rob",116,"E",77,14,227,4,11.666666666666666,28]
[29,"DIAPER, Barry",33,"E",67,19,215,4,7.666666666666667,29]
[30,"TOPPING, Mike",115,"F",87,20,198,4,2,30]
[31,"GASCOIGNE, Robert",45,"A",9,18,195,4,1,31]
[32,"WOOD, Gary",124,"B",31,18,195,4,1,31]
[33,"COOPER, Sam",25,"E",65,15,193,4,0.33333333333333331,33]
[34,"SMITH, Leon",105,"H",125,20,184,3,13.333333333333334,34]
[35,"McGILLOWAY, Wayne",75,"H",117,19,183,3,13,35]
[36,"COOPER, Phillip",24,"F",89,14,181,3,12.333333333333334,36]
[37,"TAYLOR, Mark",110,"A",8,15,180,3,12,37]
[38,"STEBBINGS, Robert",108,"F",83,16,178,3,11.333333333333334,38]
[39,"WELLS, Thomas",120,"F",91,14,178,3,11.333333333333334,39]
[40,"THORNTON, Lee",112,"F",94,17,174,3,10,40]
[41,"AKESTER, Jack",3,"G",102,20,167,3,7.666666666666667,41]
[42,"KIMBLE, John",62,"B",19,18,163,3,6.333333333333333,42]
[43,"SMART, Neil",103,"A",3,14,155,3,3.6666666666666665,43]
[44,"GARDINER, Gareth",44,"A",1,15,153,3,3,44]
[45,"SERBAN, Nelu",101,"F",92,16,152,3,2.6666666666666665,45]
[46,"DRAYTON, Simon",36,"F",84,16,150,3,2,46]
[47,"ELLIOTT, Nathan",38,"D",64,14,150,3,2,47]
[48,"PEMBERTON, Andy",86,"A",5,16,149,3,1.6666666666666667,48]
[49,"DENHOLM, Paul",32,"E",80,13,149,3,1.6666666666666667,49]
[50,"HIPPERSON, Richard",57,"G",108,13,146,3,0.66666666666666663,50]
[51,"LILL, Jarrod",70,"G",111,14,144,3,0,51]
[52,"HUTSON, Garry",60,"H",126,16,141,2,15,52]
[53,"WALES, Joe",118,"H",114,15,141,2,15,53]
[54,"FRARY, Charlie",40,"G",112,14,139,2,14.333333333333334,54]
[55,"MARTLAND, Kev",73,"A",10,14,128,2,10.666666666666666,55]
[56,"BOWELL, Ian",16,"E",75,14,128,2,10.666666666666666,55]
[57,"HARRISON, Paul",51,"A",2,12,128,2,10.666666666666666,57]
[58,"LAY-FLURRIE, Matt",66,"E",76,14,127,2,10.333333333333334,58]
[59,"PROVINS, Colin",93,"B",30,11,127,2,10.333333333333334,59]
[60,"LEE, Phil",69,"E",71,14,126,2,10,60]
[61,"CARTER, John",22,"G",110,14,116,2,6.666666666666667,61]
[62,"COTTER, Brett",26,"E",73,10,116,2,6.666666666666667,62]
[63,"DIAPER, Greg",34,"G",105,11,115,2,6.333333333333333,63]
[64,"HANCOX, Karen",50,"H",116,15,112,2,5.333333333333333,64]
[65,"PRICE, Ben",91,"C",41,9,109,2,4.333333333333333,65]
[66,"PRICE, Jimmy",92,"A",15,11,108,2,4,66]
[67,"DAWBER, Simon",31,"E",69,10,108,2,4,67]
[68,"HUTCHINSON, Dave",59,"B",22,10,107,2,3.6666666666666665,68]
[69,"PEARCE, Vic",85,"B",21,8,104,2,2.6666666666666665,69]
[70,"WRIGHT, Dave",123,"B",27,9,103,2,2.3333333333333335,70]
[71,"GREEN, Kevin",48,"D",61,9,102,2,2,71]
[72,"McCOY, Kenny",74,"F",81,10,101,2,1.6666666666666667,72]
[73,"SMITH, Stephen",106,"D",53,7,100,2,1.3333333333333333,73]
[74,"HAZELGROVE, Gary",53,"D",55,7,100,2,1.3333333333333333,73]
[75,"HIGHFIELD, Nik",55,"E",78,8,95,1,15.666666666666666,75]
[76,"BORDIANU, Adrian",14,"C",38,9,90,1,14,76]
[77,"CUTLER, Neil",30,"C",40,8,90,1,14,77]
[78,"ROYALL, Tony ",97,"D",63,6,90,1,14,78]
[79,"ADAMS, Stephen",2,"D",51,6,88,1,13.333333333333334,79]
[80,"EDWARDS, Lee",37,"F",85,11,87,1,13,80]
[81,"JOHNSON, Billy",61,"E",72,10,87,1,13,81]
[82,"NELSON, Ian",79,"D",59,8,87,1,13,82]
[83,"AUSTIN, John",7,"E",74,6,87,1,13,83]
[84,"HENNEY, Jimmy",54,"H",118,8,84,1,12,84]
[85,"ROBERTS, Steve",94,"A",14,9,83,1,11.666666666666666,85]
[86,"RYDER, Edde",99,"D",49,8,81,1,11,86]
[87,"WICKS, Maralyn",122,"B",26,7,79,1,10.333333333333334,87]
[88,"BANCROFT, Dave",9,"G",109,8,77,1,9.6666666666666661,88]
[89,"YALLOP, Oliver",125,"F",90,7,77,1,9.6666666666666661,89]
[90,"SELF, Bevan",100,"C",33,8,76,1,9.3333333333333339,90]
[91,"BETTINSON, Charles",12,"G",98,10,75,1,9,91]
[92,"PINDER, Mark",88,"D",60,8,73,1,8.3333333333333339,92]
[93,"HADDOCK, Roy",49,"H",120,8,73,1,8.3333333333333339,92]
[94,"TURNER, Cameron",117,"C",37,7,72,1,8,94]
[95,"LEE, Martin",68,"B",17,6,72,1,8,95]
[96,"TOPPING, Jack",114,"F",86,9,68,1,6.666666666666667,96]
[97,"PARKER, Daniel",83,"D",57,5,67,1,6.333333333333333,97]
[98,"FRARY, June",41,"H",113,8,65,1,5.666666666666667,98]
[99,"STORER, Paul",109,"C",35,4,48,1,0,99]
[100,"ALDOUS, David",5,"B",28,6,46,0,15.333333333333334,100]
[101,"BOTEZATO, Constantin",15,"D",56,5,46,0,15.333333333333334,101]
[102,"THOMAS, Tony",111,"E",68,4,45,0,15,102]
[103,"RUSSELL, Shane",98,"D",58,4,43,0,14.333333333333334,103]
[104,"WHITE, Alan",121,"D",52,3,40,0,13.333333333333334,104]
[105,"HARVEY, Paul ",52,"C",44,3,30,0,10,105]
[106,"KINGDON, Adam",63,"C",48,2,24,0,8,106]
[107,"PRICE, Alan",90,"C",47,2,18,0,6,107]
[108,"DOY, Alan",35,"C",39,1,18,0,6,108]
[109,"LAMBERT, Ian",65,"C",36,1,12,0,4,109]
[110,"NICHOLSON, Steven",80,"B",23,1,10,0,3.3333333333333335,110]
[111,"LEE, Louise",67,"A",16,1,8,0,2.6666666666666665,111]

{"sheet":"Ladies Day 1","index":20,"n_rows":11,"n_cols":11,"rows_kept":11,"cut":false,"hidden":false,"merged":[[0,1,0,4],[0,5,0,10],[1,0,2,0],[1,1,2,1],[1,2,2,2],[1,3,2,3],[1,4,2,4],[1,5,2,5],[1,6,2,6],[1,9,2,9],[1,10,2,10]]}
[null,"UK LADIES CHAMPIONSHIPS        2020-21",null,null,null,"Day 1 (Individuals)"]
["Individual No.","Angler Name","Angler No.","Zone","Peg","No. Fish","Fish Points","Weight",null,"Day 1 Points","Day 1 Position"]
[null,null,null,null,null,null,null,"lbs","oz"]
[1,"WICKS, Maralyn",122,"G",112,2,60,1,4,1,1]
[2,"BROWN, Kay",18,"B",24,1,44,0,14.666666666666666,2,2]
[3,"LINDFIELD, Heather",72,"B",31,2,31,0,10.333333333333334,3,3]
[4,"METCALFE, Wendy",19,"B",25,1,13,0,4.333333333333333,4,4]
[5,"FRARY, June",41,"B",28,0,0,0,0,5,5]
[6,"HANCOX, Karen",50,"B",29,0,0,0,0,5,5]
[7,"HILLS, Amy",56,"C",34,0,0,0,0,5,5]
[8,"LEE, Louise",67,"H",119,0,0,0,0,5,5]

{"sheet":"Ladies Day 2","index":21,"n_rows":11,"n_cols":11,"rows_kept":11,"cut":false,"hidden":false,"merged":[[0,1,0,4],[0,5,0,10],[1,0,2,0],[1,1,2,1],[1,2,2,2],[1,3,2,3],[1,4,2,4],[1,5,2,5],[1,6,2,6],[1,9,2,9],[1,10,2,10]]}
[null,"UK LADIES CHAMPIONSHIPS        2020-21",null,null,null,"Day 2 (Individuals)"]
["Individual No.","Angler Name","Angler No.","Zone","Peg","No. Fish","Fish Points","Weight",null,"Day 2 Points","Day 2 Position"]
[null,null,null,null,null,null,null,"lbs","oz"]
[1,"WICKS, Maralyn",122,"B",26,18,265,5,8.3333333333333339,1,1]
[2,"LINDFIELD, Heather",72,"G",104,20,194,4,0.66666666666666663,2,2]
[3,"LEE, Louise",67,"A",16,12,179,3,11.666666666666666,3,3]
[4,"BROWN, Kay",18,"G",106,16,160,3,5.333333333333333,4,4]
[5,"METCALFE, Wendy",19,"G",107,13,155,3,3.6666666666666665,5,5]
[6,"FRARY, June",41,"H",113,16,141,2,15,6,6]
[7,"HANCOX, Karen",50,"H",116,17,137,2,13.666666666666666,7,7]
[8,"HILLS, Amy",56,"E",79,0,0,0,0,8,8]

{"sheet":"Juniors Day 1","index":22,"n_rows":6,"n_cols":10,"rows_kept":6,"cut":false,"hidden":false,"merged":[[1,0,2,0],[1,1,2,1],[1,2,2,2],[1,3,2,3],[1,4,2,4],[1,9,2,9],[0,1,0,4],[0,5,0,9],[1,5,2,5],[1,6,2,6]]}
[null,"NORTH NORFOLK JUNIORS TOURNAMENT 2020-21",null,null,null,"Day 1 (Juniors)"]
["Individual No.","Angler Name","Angler No.","Zone","Peg","No. Fish","Fish Points","Weight",null,"Day 1 Position"]
[null,null,null,null,null,null,null,"lbs","oz"]
[1,"TOPPING, Jack",114,"A",13,7,135,2,13,1]
[2,"BANHAM, Mark",11,"H",115,1,16,0,5.333333333333333,2]
[3,"ALDOUS, Brayden",4,"F",94,1,12,0,4,3]

{"sheet":"Juniors Day 2","index":23,"n_rows":6,"n_cols":10,"rows_kept":6,"cut":false,"hidden":false,"merged":[[1,0,2,0],[1,1,2,1],[1,2,2,2],[1,3,2,3],[1,4,2,4],[1,9,2,9],[0,1,0,4],[0,5,0,9],[1,5,2,5],[1,6,2,6]]}
[null,"NORTH NORFOLK JUNIORS TOURNAMENT 2020-21",null,null,null,"Day 2 (Juniors)"]
["Individual No.","Angler Name","Angler No.","Zone","Peg","No. Fish","Fish Points","Weight",null,"Day 2 Position"]
[null,null,null,null,null,null,null,"lbs","oz"]
[1,"BANHAM, Mark",11,"A",7,9,151,3,2.3333333333333335,1]
[2,"TOPPING, Jack",114,"F",86,14,134,2,12.666666666666666,2]
[3,"ALDOUS, Brayden",4,"B",29,6,77,1,9.6666666666666661,3]

{"sheet":"Shannock Quads Day 1","index":24,"n_rows":16,"n_cols":8,"rows_kept":16,"cut":false,"hidden":false,"merged":[[1,0,2,0],[0,1,0,3],[1,1,2,1],[0,4,0,7],[1,2,2,2],[1,3,2,3],[1,4,2,4],[1,5,2,5]]}
[null,"SHANNOCK QUADS 2020-21",null,null,"Day 1 (Teams)"]
["Team Count","Day 1 Position","Team No.","Team Name","No. Fish","Fish Points","Weight"]
[null,null,null,null,null,null,"lbs","oz"]
[1,1,1,"TEAM BREAKAWAY",53,867,18,1]
[2,2,4,"THE MAGGOTS",56,855,17,13]
[3,3,10,"ANYFISH ANYWHERE ASSO",48,786,16,6]
[4,4,7,"SHEEP SHAGERS",30,550,11,7.333333333333333]
[5,5,12,"NORTH NORFOLK LADS",31,541,11,4.333333333333333]
[6,6,9,"IPSWICH SEA ANGLERS",29,512,10,10.666666666666666]
[7,7,13,"GORLESTON TACKLE",20,354,7,6]
[8,8,11,"BENNET ROOFING",29,334,6,15.333333333333334]
[9,9,5,"SAUL & CO",22,326,6,12.666666666666666]
[10,10,3,"TEAM BIRDS",16,318,6,10]
[11,11,2,"TIDLER SQUAD",24,297,6,3]
[12,12,6,"PRICEY'S GUYS & GAL",23,287,5,15.666666666666666]
[13,13,8,"VETERANS + 1",14,203,4,3.6666666666666665]

{"sheet":"Shannock Quads Day 2","index":25,"n_rows":16,"n_cols":8,"rows_kept":16,"cut":false,"hidden":false,"merged":[[0,1,0,3],[0,4,0,7],[1,5,2,5],[1,0,2,0],[1,1,2,1],[1,2,2,2],[1,3,2,3],[1,4,2,4]]}
[null,"SHANNOCK QUADS 2020-21",null,null,"Day 2 (Teams)"]
["Team Count","Day 2 Position","Team No.","Team Name","No. Fish","Fish Points","Weight"]
[null,null,null,null,null,null,"lbs","oz"]
[1,1,1,"TEAM BREAKAWAY",101,2204,45,14.666666666666666]
[2,2,4,"THE MAGGOTS",136,1807,37,10.333333333333334]
[3,3,7,"SHEEP SHAGERS",100,1662,34,10]
[4,4,10,"ANYFISH ANYWHERE ASSO",124,1599,33,5]
[5,5,2,"TIDLER SQUAD",83,1251,26,1]
[6,6,12,"NORTH NORFOLK LADS",87,1226,25,8.6666666666666661]
[7,7,5,"SAUL & CO",90,1141,23,12.333333333333334]
[8,8,6,"PRICEY'S GUYS & GAL",67,1075,22,6.333333333333333]
[9,9,11,"BENNET ROOFING",76,966,20,2]
[10,10,13,"GORLESTON TACKLE",71,941,19,9.6666666666666661]
[11,11,8,"VETERANS + 1",60,867,18,1]
[12,12,9,"IPSWICH SEA ANGLERS",76,847,17,10.333333333333334]
[13,13,3,"TEAM BIRDS",70,829,17,4.333333333333333]

{"sheet":"All Day 1 Heaviest Bass","index":26,"n_rows":31,"n_cols":9,"rows_kept":31,"cut":false,"hidden":false,"merged":[[1,7,2,7],[1,8,2,8],[0,4,0,8],[0,0,0,3],[1,0,2,0],[1,2,2,2],[1,1,2,1],[1,4,2,4],[1,3,2,3]]}
["OVERALL 2020-21",null,null,null,"Day 1 - Heaviest Bass"]
["Individual No.","Angler Name","Angler No.","Peg","Fish Points","Weight",null,"Species","Day 1 Position"]
[null,null,null,null,null,"lbs","oz"]
[1,"ROYALL, Tony ",97,123,158,3,4.666666666666667,"BASS",1]
[2,"ROPER, Liam",96,107,129,2,11,"BASS",2]
[3,"SMITH, George",104,55,116,2,6.666666666666667,"BASS",3]
[4,"DOY, Alan",35,95,116,2,6.666666666666667,"BASS",3]
[5,"Unused Pegs 2",128,1,110,2,4.666666666666667,"BASS",5]
[6,"WALES, Joe",118,4,110,2,4.666666666666667,"BASS",5]
[7,"RUSSELL, Shane",98,72,110,2,4.666666666666667,"BASS",5]
[8,"YALLOP, Oliver",125,3,104,2,2.6666666666666665,"BASS",8]
[9,"ROGERS, Mark",95,21,104,2,2.6666666666666665,"BASS",8]
[10,"BOND, Darren",13,63,104,2,2.6666666666666665,"BASS",8]
[11,"McGILLOWAY, Wayne",75,6,98,2,0.66666666666666663,"BASS",11]
[12,"LEE, Martin",68,120,98,2,0.66666666666666663,"BASS",11]
[13,"CROSBY, Ralf",29,86,92,1,14.666666666666666,"BASS",13]
[14,"WRIGHT, Dave",123,113,92,1,14.666666666666666,"BASS",13]
[15,"BURT, Richard",20,16,68,1,6.666666666666667,"BASS",15]
[16,"SERBAN, Nelu",101,50,68,1,6.666666666666667,"BASS",15]
[17,"LAMBERT, Ian",65,67,68,1,6.666666666666667,"BASS",15]
[18,"ADAMS, Stephen",2,128,68,1,6.666666666666667,"BASS",15]
[19,"WELLS, Thomas",120,52,63,1,5,"BASS",19]
[20,"WICKS, Maralyn",122,112,55,1,2.3333333333333335,"BASS",20]
[21,"TOPPING, Jack",114,13,51,1,1,"BASS",21]
[22,"BUY, Craig",21,49,51,1,1,"BASS",21]
[23,"NELSON, Ian",79,73,51,1,1,"BASS",21]
[24,"LAY-FLURRIE, Matt",66,12,47,0,15.666666666666666,"BASS",24]
[25,"RYDER, Edde",99,87,47,0,15.666666666666666,"BASS",24]
[26,"GOOCH, Mark",47,18,43,0,14.333333333333334,"BASS",26]
[27,"GREEN, Kevin",48,122,40,0,13.333333333333334,"BASS",27]
[28,"DENHOLM, Paul",32,38,37,0,12.333333333333334,"BASS",28]

{"sheet":"All Day 2 Heaviest Bass","index":27,"n_rows":11,"n_cols":9,"rows_kept":11,"cut":false,"hidden":false,"merged":[[0,0,0,3],[0,4,0,8],[1,7,2,7],[1,8,2,8],[1,0,2,0],[1,1,2,1],[1,2,2,2],[1,3,2,3],[1,4,2,4]]}
["OVERALL 2020-21",null,null,null,"Day 2 - Heaviest Bass"]
["Individual No.","Angler Name","Angler No.","Peg","Fish Points","Weight",null,"Species","Day 2 Position"]
[null,null,null,null,null,"lbs","oz"]
[1,"McCOY, Kenny",74,81,122,2,8.6666666666666661,"BASS",1]
[2,"WOOD, Gary",124,31,116,2,6.666666666666667,"BASS",2]
[3,"TAYLOR, Mark",110,8,104,2,2.6666666666666665,"BASS",3]
[4,"WRIGHT, Dave",123,27,80,1,10.666666666666666,"BASS",4]
[5,"NANGLE, Karl",78,18,74,1,8.6666666666666661,"BASS",5]
[6,"GARDINER, Gareth",44,1,47,0,15.666666666666666,"BASS",6]
[7,"FRENCH, Julian",42,24,16,0,5.333333333333333,"BASS",7]
[8,"SELF, Bevan",100,33,16,0,5.333333333333333,"BASS",7]

{"sheet":"Bass Fest. Day 1 Heaviest Flat","index":28,"n_rows":92,"n_cols":9,"rows_kept":92,"cut":false,"hidden":false,"merged":[[0,1,0,3],[0,4,0,8],[1,7,2,7],[1,8,2,8],[1,0,2,0],[1,1,2,1],[1,2,2,2],[1,3,2,3],[1,4,2,4]]}
[null,"BASS FESTIVAL 2020-21",null,null,"Day 1 - Heaviest Flat"]
["Individual No.","Angler Name","Angler No.","Peg","Fish Points","Weight",null,"Species","Day 1 Position"]
[null,null,null,null,null,"lbs","oz"]
[1,{"$f":"IF(I4=\"\",\"\",IF(ISNA(VLOOKUP($D4,'[2]Teams & Anglers'!$B$7:$F$156,1,FALSE))=TRUE,\"\",VLOOKUP($D4,'[2]Teams & Anglers'!$B$7:$F$1566,4,FALSE)))","v":"CROSBY, Colin"},{"$f":"IF(ISNA(VLOOKUP($D4,'[2]Teams & Anglers'!$B$7:$F$156,1,FALSE))=TRUE,\"\",VLOOKUP($D4,'[2]Teams & Anglers'!$B$7:$F$1566,3,FALSE))","v":28},{"$f":"IF(I4=\"\",\"\",INDEX('[2]Day 1 (All)'!$AA$3:$AA$152,SMALL(IF('[2]Day 1 (All)'!$O$3:$O$152=$I4,ROW('[2]Day 1 (All)'!$O$3:$O$152)-ROW(I$4)+2),COUNTIF($I$4:$I4,$I4))))","v":2},{"$f":"IF($B4=\"\",\"\",IF(ISNA(VLOOKUP($C4,'[2]Day 1 (All)'!$Y$3:$Z$300,1,FALSE))=TRUE,0,VLOOKUP($D4,'[2]Day 1 data entry'!C$3:X$152,19,FALSE)))","v":60},1,4,{"$f":"IF($B4=\"\",\"\",IF(ISNA(VLOOKUP($C4,'[2]Day 1 (All)'!$Y$3:$Z$300,1,FALSE))=TRUE,0,VLOOKUP($D4,'[2]Day 1 data entry'!C$3:X$152,22,FALSE)))","v":"FLOUNDER"},{"$f":"IF(ISERROR(SMALL('[2]Day 1 (All)'!O$3:O$152,A4))=TRUE,\"\",(SMALL('[2]Day 1 (All)'!O$3:O$152,A4)))","v":1}]
[2,{"$f":"IF(I5=\"\",\"\",IF(ISNA(VLOOKUP($D5,'[2]Teams & Anglers'!$B$7:$F$156,1,FALSE))=TRUE,\"\",VLOOKUP($D5,'[2]Teams & Anglers'!$B$7:$F$1566,4,FALSE)))","v":"JOHNSON, Billy"},{"$f":"IF(ISNA(VLOOKUP($D5,'[2]Teams & Anglers'!$B$7:$F$156,1,FALSE))=TRUE,\"\",VLOOKUP($D5,'[2]Teams & Anglers'!$B$7:$F$1566,3,FALSE))","v":61},{"$f":"IF(I5=\"\",\"\",INDEX('[2]Day 1 (All)'!$AA$3:$AA$152,SMALL(IF('[2]Day 1 (All)'!$O$3:$O$152=$I5,ROW('[2]Day 1 (All)'!$O$3:$O$152)-ROW(I$4)+2),COUNTIF($I$4:$I5,$I5))))","v":5},{"$f":"IF($B5=\"\",\"\",IF(ISNA(VLOOKUP($C5,'[2]Day 1 (All)'!$Y$3:$Z$300,1,FALSE))=TRUE,0,VLOOKUP($D5,'[2]Day 1 data entry'!C$3:X$152,19,FALSE)))","v":60},1,4,{"$f":"IF($B5=\"\",\"\",IF(ISNA(VLOOKUP($C5,'[2]Day 1 (All)'!$Y$3:$Z$300,1,FALSE))=TRUE,0,VLOOKUP($D5,'[2]Day 1 data entry'!C$3:X$152,22,FALSE)))","v":"FLOUNDER"},{"$f":"IF(ISERROR(SMALL('[2]Day 1 (All)'!O$3:O$152,A5))=TRUE,\"\",(SMALL('[2]Day 1 (All)'!O$3:O$152,A5)))","v":1}]
[3,{"$f":"IF(I6=\"\",\"\",IF(ISNA(VLOOKUP($D6,'[2]Teams & Anglers'!$B$7:$F$156,1,FALSE))=TRUE,\"\",VLOOKUP($D6,'[2]Teams & Anglers'!$B$7:$F$1566,4,FALSE)))","v":"WALES, Joe"},{"$f":"IF(ISNA(VLOOKUP($D6,'[2]Teams & Anglers'!$B$7:$F$156,1,FALSE))=TRUE,\"\",VLOOKUP($D6,'[2]Teams & Anglers'!$B$7:$F$1566,3,FALSE))","v":118},{"$f":"IF(I6=\"\",\"\",INDEX('[2]Day 1 (All)'!$AA$3:$AA$152,SMALL(IF('[2]Day 1 (All)'!$O$3:$O$152=$I6,ROW('[2]Day 1 (All)'!$O$3:$O$152)-ROW(I$4)+2),COUNTIF($I$4:$I6,$I6))))","v":4},{"$f":"IF($B6=\"\",\"\",IF(ISNA(VLOOKUP($C6,'[2]Day 1 (All)'!$Y$3:$Z$300,1,FALSE))=TRUE,0,VLOOKUP($D6,'[2]Day 1 data entry'!C$3:X$152,19,FALSE)))","v":56},1,2.6666666666666665,{"$f":"IF($B6=\"\",\"\",IF(ISNA(VLOOKUP($C6,'[2]Day 1 (All)'!$Y$3:$Z$300,1,FALSE))=TRUE,0,VLOOKUP($D6,'[2]Day 1 data entry'!C$3:X$152,22,FALSE)))","v":"FLOUNDER"},{"$f":"IF(ISERROR(SMALL('[2]Day 1 (All)'!O$3:O$152,A6))=TRUE,\"\",(SMALL('[2]Day 1 (All)'!O$3:O$152,A6)))","v":3}]
[4,{"$f":"IF(I7=\"\",\"\",IF(ISNA(VLOOKUP($D7,'[2]Teams & Anglers'!$B$7:$F$156,1,FALSE))=TRUE,\"\",VLOOKUP($D7,'[2]Teams & Anglers'!$B$7:$F$1566,4,FALSE)))","v":"GARDINER, Gareth"},{"$f":"IF(ISNA(VLOOKUP($D7,'[2]Teams & Anglers'!$B$7:$F$156,1,FALSE))=TRUE,\"\",VLOOKUP($D7,'[2]Teams & Anglers'!$B$7:$F$1566,3,FALSE))","v":44},{"$f":"IF(I7=\"\",\"\",INDEX('[2]Day 1 (All)'!$AA$3:$AA$152,SMALL(IF('[2]Day 1 (All)'!$O$3:$O$152=$I7,ROW('[2]Day 1 (All)'!$O$3:$O$152)-ROW(I$4)+2),COUNTIF($I$4:$I7,$I7))))","v":118},{"$f":"IF($B7=\"\",\"\",IF(ISNA(VLOOKUP($C7,'[2]Day 1 (All)'!$Y$3:$Z$300,1,FALSE))=TRUE,0,VLOOKUP($D7,'[2]Day 1 data entry'!C$3:X$152,19,FALSE)))","v":56},1,2.6666666666666665,{"$f":"IF($B7=\"\",\"\",IF(ISNA(VLOOKUP($C7,'[2]Day 1 (All)'!$Y$3:$Z$300,1,FALSE))=TRUE,0,VLOOKUP($D7,'[2]Day 1 data entry'!C$3:X$152,22,FALSE)))","v":"FLOUNDER"},{"$f":"IF(ISERROR(SMALL('[2]Day 1 (All)'!O$3:O$152,A7))=TRUE,\"\",(SMALL('[2]Day 1 (All)'!O$3:O$152,A7)))","v":3}]
[5,{"$f":"IF(I8=\"\",\"\",IF(ISNA(VLOOKUP($D8,'[2]Teams & Anglers'!$B$7:$F$156,1,FALSE))=TRUE,\"\",VLOOKUP($D8,'[2]Teams & Anglers'!$B$7:$F$1566,4,FALSE)))","v":"YALLOP, Oliver"},{"$f":"IF(ISNA(VLOOKUP($D8,'[2]Teams & Anglers'!$B$7:$F$156,1,FALSE))=TRUE,\"\",VLOOKUP($D8,'[2]Teams & Anglers'!$B$7:$F$1566,3,FALSE))","v":125},{"$f":"IF(I8=\"\",\"\",INDEX('[2]Day 1 (All)'!$AA$3:$AA$152,SMALL(IF('[2]Day 1 (All)'!$O$3:$O$152=$I8,ROW('[2]Day 1 (All)'!$O$3:$O$152)-ROW(I$4)+2),COUNTIF($I$4:$I8,$I8))))","v":3},{"$f":"IF($B8=\"\",\"\",IF(ISNA(VLOOKUP($C8,'[2]Day 1 (All)'!$Y$3:$Z$300,1,FALSE))=TRUE,0,VLOOKUP($D8,'[2]Day 1 data entry'!C$3:X$152,19,FALSE)))","v":52},1,1.3333333333333333,{"$f":"IF($B8=\"\",\"\",IF(ISNA(VLOOKUP($C8,'[2]Day 1 (All)'!$Y$3:$Z$300,1,FALSE))=TRUE,0,VLOOKUP($D8,'[2]Day 1 data entry'!C$3:X$152,22,FALSE)))","v":"FLOUNDER"},{"$f":"IF(ISERROR(SMALL('[2]Day 1 (All)'!O$3:O$152,A8))=TRUE,\"\",(SMALL('[2]Day 1 (All)'!O$3:O$152,A8)))","v":5}]
[6,{"$f":"IF(I9=\"\",\"\",IF(ISNA(VLOOKUP($D9,'[2]Teams & Anglers'!$B$7:$F$156,1,FALSE))=TRUE,\"\",VLOOKUP($D9,'[2]Teams & Anglers'!$B$7:$F$1566,4,FALSE)))","v":"DRAYTON, Simon"},{"$f":"IF(ISNA(VLOOKUP($D9,'[2]Teams & Anglers'!$B$7:$F$156,1,FALSE))=TRUE,\"\",VLOOKUP($D9,'[2]Teams & Anglers'!$B$7:$F$1566,3,FALSE))","v":36},{"$f":"IF(I9=\"\",\"\",INDEX('[2]Day 1 (All)'!$AA$3:$AA$152,SMALL(IF('[2]Day 1 (All)'!$O$3:$O$152=$I9,ROW('[2]Day 1 (All)'!$O$3:$O$152)-ROW(I$4)+2),COUNTIF($I$4:$I9,$I9))))","v":62},{"$f":"IF($B9=\"\",\"\",IF(ISNA(VLOOKUP($C9,'[2]Day 1 (All)'!$Y$3:$Z$300,1,FALSE))=TRUE,0,VLOOKUP($D9,'[2]Day 1 data entry'!C$3:X$152,19,FALSE)))","v":52},1,1.3333333333333333,{"$f":"IF($B9=\"\",\"\",IF(ISNA(VLOOKUP($C9,'[2]Day 1 (All)'!$Y$3:$Z$300,1,FALSE))=TRUE,0,VLOOKUP($D9,'[2]Day 1 data entry'!C$3:X$152,22,FALSE)))","v":"FLOUNDER"},{"$f":"IF(ISERROR(SMALL('[2]Day 1 (All)'!O$3:O$152,A9))=TRUE,\"\",(SMALL('[2]Day 1 (All)'!O$3:O$152,A9)))","v":5}]
[7,{"$f":"IF(I10=\"\",\"\",IF(ISNA(VLOOKUP($D10,'[2]Teams & Anglers'!$B$7:$F$156,1,FALSE))=TRUE,\"\",VLOOKUP($D10,'[2]Teams & Anglers'!$B$7:$F$1566,4,FALSE)))","v":"GREEN, Kevin"},{"$f":"IF(ISNA(VLOOKUP($D10,'[2]Teams & Anglers'!$B$7:$F$156,1,FALSE))=TRUE,\"\",VLOOKUP($D10,'[2]Teams & Anglers'!$B$7:$F$1566,3,FALSE))","v":48},{"$f":"IF(I10=\"\",\"\",INDEX('[2]Day 1 (All)'!$AA$3:$AA$152,SMALL(IF('[2]Day 1 (All)'!$O$3:$O$152=$I10,ROW('[2]Day 1 (All)'!$O$3:$O$152)-ROW(I$4)+2),COUNTIF($I$4:$I10,$I10))))","v":122},{"$f":"IF($B10=\"\",\"\",IF(ISNA(VLOOKUP($C10,'[2]Day 1 (All)'!$Y$3:$Z$300,1,FALSE))=TRUE,0,VLOOKUP($D10,'[2]Day 1 data entry'!C$3:X$152,19,FALSE)))","v":52},1,1.3333333333333333,{"$f":"IF($B10=\"\",\"\",IF(ISNA(VLOOKUP($C10,'[2]Day 1 (All)'!$Y$3:$Z$300,1,FALSE))=TRUE,0,VLOOKUP($D10,'[2]Day 1 data entry'!C$3:X$152,22,FALSE)))","v":"FLOUNDER"},{"$f":"IF(ISERROR(SMALL('[2]Day 1 (All)'!O$3:O$152,A10))=TRUE,\"\",(SMALL('[2]Day 1 (All)'!O$3:O$152,A10)))","v":5}]
[8,{"$f":"IF(I11=\"\",\"\",IF(ISNA(VLOOKUP($D11,'[2]Teams & Anglers'!$B$7:$F$156,1,FALSE))=TRUE,\"\",VLOOKUP($D11,'[2]Teams & Anglers'!$B$7:$F$1566,4,FALSE)))","v":"ROBERTS, Steve"},{"$f":"IF(ISNA(VLOOKUP($D11,'[2]Teams & Anglers'!$B$7:$F$156,1,FALSE))=TRUE,\"\",VLOOKUP($D11,'[2]Teams & Anglers'!$B$7:$F$1566,3,FALSE))","v":94},{"$f":"IF(I11=\"\",\"\",INDEX('[2]Day 1 (All)'!$AA$3:$AA$152,SMALL(IF('[2]Day 1 (All)'!$O$3:$O$152=$I11,ROW('[2]Day 1 (All)'!$O$3:$O$152)-ROW(I$4)+2),COUNTIF($I$4:$I11,$I11))))","v":68},{"$f":"IF($B11=\"\",\"\",IF(ISNA(VLOOKUP($C11,'[2]Day 1 (All)'!$Y$3:$Z$300,1,FALSE))=TRUE,0,VLOOKUP($D11,'[2]Day 1 data entry'!C$3:X$152,19,FALSE)))","v":44},0,14.666666666666666,{"$f":"IF($B11=\"\",\"\",IF(ISNA(VLOOKUP($C11,'[2]Day 1 (All)'!$Y$3:$Z$300,1,FALSE))=TRUE,0,VLOOKUP($D11,'[2]Day 1 data entry'!C$3:X$152,22,FALSE)))","v":"FLOUNDER"},{"$f":"IF(ISERROR(SMALL('[2]Day 1 (All)'!O$3:O$152,A11))=TRUE,\"\",(SMALL('[2]Day 1 (All)'!O$3:O$152,A11)))","v":8}]
[9,{"$f":"IF(I12=\"\",\"\",IF(ISNA(VLOOKUP($D12,'[2]Teams & Anglers'!$B$7:$F$156,1,FALSE))=TRUE,\"\",VLOOKUP($D12,'[2]Teams & Anglers'!$B$7:$F$1566,4,FALSE)))","v":"CARTER, John"},{"$f":"IF(ISNA(VLOOKUP($D12,'[2]Teams & Anglers'!$B$7:$F$156,1,FALSE))=TRUE,\"\",VLOOKUP($D12,'[2]Teams & Anglers'!$B$7:$F$1566,3,FALSE))","v":22},{"$f":"IF(I12=\"\",\"\",INDEX('[2]Day 1 (All)'!$AA$3:$AA$152,SMALL(IF('[2]Day 1 (All)'!$O$3:$O$152=$I12,ROW('[2]Day 1 (All)'!$O$3:$O$152)-ROW(I$4)+2),COUNTIF($I$4:$I12,$I12))))","v":26},{"$f":"IF($B12=\"\",\"\",IF(ISNA(VLOOKUP($C12,'[2]Day 1 (All)'!$Y$3:$Z$300,1,FALSE))=TRUE,0,VLOOKUP($D12,'[2]Day 1 data entry'!C$3:X$152,19,FALSE)))","v":40},0,13.333333333333334,{"$f":"IF($B12=\"\",\"\",IF(ISNA(VLOOKUP($C12,'[2]Day 1 (All)'!$Y$3:$Z$300,1,FALSE))=TRUE,0,VLOOKUP($D12,'[2]Day 1 data entry'!C$3:X$152,22,FALSE)))","v":"FLOUNDER"},{"$f":"IF(ISERROR(SMALL('[2]Day 1 (All)'!O$3:O$152,A12))=TRUE,\"\",(SMALL('[2]Day 1 (All)'!O$3:O$152,A12)))","v":9}]
[10,{"$f":"IF(I13=\"\",\"\",IF(ISNA(VLOOKUP($D13,'[2]Teams & Anglers'!$B$7:$F$156,1,FALSE))=TRUE,\"\",VLOOKUP($D13,'[2]Teams & Anglers'!$B$7:$F$1566,4,FALSE)))","v":"CROSBY, Ralf"},{"$f":"IF(ISNA(VLOOKUP($D13,'[2]Teams & Anglers'!$B$7:$F$156,1,FALSE))=TRUE,\"\",VLOOKUP($D13,'[2]Teams & Anglers'!$B$7:$F$1566,3,FALSE))","v":29},{"$f":"IF(I13=\"\",\"\",INDEX('[2]Day 1 (All)'!$AA$3:$AA$152,SMALL(IF('[2]Day 1 (All)'!$O$3:$O$152=$I13,ROW('[2]Day 1 (All)'!$O$3:$O$152)-ROW(I$4)+2),COUNTIF($I$4:$I13,$I13))))","v":86},{"$f":"IF($B13=\"\",\"\",IF(ISNA(VLOOKUP($C13,'[2]Day 1 (All)'!$Y$3:$Z$300,1,FALSE))=TRUE,0,VLOOKUP($D13,'[2]Day 1 data entry'!C$3:X$152,19,FALSE)))","v":40},0,13.333333333333334,{"$f":"IF($B13=\"\",\"\",IF(ISNA(VLOOKUP($C13,'[2]Day 1 (All)'!$Y$3:$Z$300,1,FALSE))=TRUE,0,VLOOKUP($D13,'[2]Day 1 data entry'!C$3:X$152,22,FALSE)))","v":"FLOUNDER"},{"$f":"IF(ISERROR(SMALL('[2]Day 1 (All)'!O$3:O$152,A13))=TRUE,\"\",(SMALL('[2]Day 1 (All)'!O$3:O$152,A13)))","v":9}]
[11,{"$f":"IF(I14=\"\",\"\",IF(ISNA(VLOOKUP($D14,'[2]Teams & Anglers'!$B$7:$F$156,1,FALSE))=TRUE,\"\",VLOOKUP($D14,'[2]Teams & Anglers'!$B$7:$F$1566,4,FALSE)))","v":"PINDER, Mark"},{"$f":"IF(ISNA(VLOOKUP($D14,'[2]Teams & Anglers'!$B$7:$F$156,1,FALSE))=TRUE,\"\",VLOOKUP($D14,'[2]Teams & Anglers'!$B$7:$F$1566,3,FALSE))","v":88},{"$f":"IF(I14=\"\",\"\",INDEX('[2]Day 1 (All)'!$AA$3:$AA$152,SMALL(IF('[2]Day 1 (All)'!$O$3:$O$152=$I14,ROW('[2]Day 1 (All)'!$O$3:$O$152)-ROW(I$4)+2),COUNTIF($I$4:$I14,$I14))))","v":96},{"$f":"IF($B14=\"\",\"\",IF(ISNA(VLOOKUP($C14,'[2]Day 1 (All)'!$Y$3:$Z$300,1,FALSE))=TRUE,0,VLOOKUP($D14,'[2]Day 1 data entry'!C$3:X$152,19,FALSE)))","v":40},0,13.333333333333334,{"$f":"IF($B14=\"\",\"\",IF(ISNA(VLOOKUP($C14,'[2]Day 1 (All)'!$Y$3:$Z$300,1,FALSE))=TRUE,0,VLOOKUP($D14,'[2]Day 1 data entry'!C$3:X$152,22,FALSE)))","v":"FLOUNDER"},{"$f":"IF(ISERROR(SMALL('[2]Day 1 (All)'!O$3:O$152,A14))=TRUE,\"\",(SMALL('[2]Day 1 (All)'!O$3:O$152,A14)))","v":9}]
[12,{"$f":"IF(I15=\"\",\"\",IF(ISNA(VLOOKUP($D15,'[2]Teams & Anglers'!$B$7:$F$156,1,FALSE))=TRUE,\"\",VLOOKUP($D15,'[2]Teams & Anglers'!$B$7:$F$1566,4,FALSE)))","v":"HUTSON, Garry"},{"$f":"IF(ISNA(VLOOKUP($D15,'[2]Teams & Anglers'!$B$7:$F$156,1,FALSE))=TRUE,\"\",VLOOKUP($D15,'[2]Teams & Anglers'!$B$7:$F$1566,3,FALSE))","v":60},{"$f":"IF(I15=\"\",\"\",INDEX('[2]Day 1 (All)'!$AA$3:$AA$152,SMALL(IF('[2]Day 1 (All)'!$O$3:$O$152=$I15,ROW('[2]Day 1 (All)'!$O$3:$O$152)-ROW(I$4)+2),COUNTIF($I$4:$I15,$I15))))","v":53},{"$f":"IF($B15=\"\",\"\",IF(ISNA(VLOOKUP($C15,'[2]Day 1 (All)'!$Y$3:$Z$300,1,FALSE))=TRUE,0,VLOOKUP($D15,'[2]Day 1 data entry'!C$3:X$152,19,FALSE)))","v":36},0,12,{"$f":"IF($B15=\"\",\"\",IF(ISNA(VLOOKUP($C15,'[2]Day 1 (All)'!$Y$3:$Z$300,1,FALSE))=TRUE,0,VLOOKUP($D15,'[2]Day 1 data entry'!C$3:X$152,22,FALSE)))","v":"FLOUNDER"},{"$f":"IF(ISERROR(SMALL('[2]Day 1 (All)'!O$3:O$152,A15))=TRUE,\"\",(SMALL('[2]Day 1 (All)'!O$3:O$152,A15)))","v":12}]
[13,{"$f":"IF(I16=\"\",\"\",IF(ISNA(VLOOKUP($D16,'[2]Teams & Anglers'!$B$7:$F$156,1,FALSE))=TRUE,\"\",VLOOKUP($D16,'[2]Teams & Anglers'!$B$7:$F$1566,4,FALSE)))","v":"WOOD, Gary"},{"$f":"IF(ISNA(VLOOKUP($D16,'[2]Teams & Anglers'!$B$7:$F$156,1,FALSE))=TRUE,\"\",VLOOKUP($D16,'[2]Teams & Anglers'!$B$7:$F$1566,3,FALSE))","v":124},{"$f":"IF(I16=\"\",\"\",INDEX('[2]Day 1 (All)'!$AA$3:$AA$152,SMALL(IF('[2]Day 1 (All)'!$O$3:$O$152=$I16,ROW('[2]Day 1 (All)'!$O$3:$O$152)-ROW(I$4)+2),COUNTIF($I$4:$I16,$I16))))","v":105},{"$f":"IF($B16=\"\",\"\",IF(ISNA(VLOOKUP($C16,'[2]Day 1 (All)'!$Y$3:$Z$300,1,FALSE))=TRUE,0,VLOOKUP($D16,'[2]Day 1 data entry'!C$3:X$152,19,FALSE)))","v":36},0,12,{"$f":"IF($B16=\"\",\"\",IF(ISNA(VLOOKUP($C16,'[2]Day 1 (All)'!$Y$3:$Z$300,1,FALSE))=TRUE,0,VLOOKUP($D16,'[2]Day 1 data entry'!C$3:X$152,22,FALSE)))","v":"FLOUNDER"},{"$f":"IF(ISERROR(SMALL('[2]Day 1 (All)'!O$3:O$152,A16))=TRUE,\"\",(SMALL('[2]Day 1 (All)'!O$3:O$152,A16)))","v":12}]
[14,{"$f":"IF(I17=\"\",\"\",IF(ISNA(VLOOKUP($D17,'[2]Teams & Anglers'!$B$7:$F$156,1,FALSE))=TRUE,\"\",VLOOKUP($D17,'[2]Teams & Anglers'!$B$7:$F$1566,4,FALSE)))","v":"COOPER, Sam"},{"$f":"IF(ISNA(VLOOKUP($D17,'[2]Teams & Anglers'!$B$7:$F$156,1,FALSE))=TRUE,\"\",VLOOKUP($D17,'[2]Teams & Anglers'!$B$7:$F$1566,3,FALSE))","v":25},{"$f":"IF(I17=\"\",\"\",INDEX('[2]Day 1 (All)'!$AA$3:$AA$152,SMALL(IF('[2]Day 1 (All)'!$O$3:$O$152=$I17,ROW('[2]Day 1 (All)'!$O$3:$O$152)-ROW(I$4)+2),COUNTIF($I$4:$I17,$I17))))","v":10},{"$f":"IF($B17=\"\",\"\",IF(ISNA(VLOOKUP($C17,'[2]Day 1 (All)'!$Y$3:$Z$300,1,FALSE))=TRUE,0,VLOOKUP($D17,'[2]Day 1 data entry'!C$3:X$152,19,FALSE)))","v":32},0,10.666666666666666,{"$f":"IF($B17=\"\",\"\",IF(ISNA(VLOOKUP($C17,'[2]Day 1 (All)'!$Y$3:$Z$300,1,FALSE))=TRUE,0,VLOOKUP($D17,'[2]Day 1 data entry'!C$3:X$152,22,FALSE)))","v":"FLOUNDER"},{"$f":"IF(ISERROR(SMALL('[2]Day 1 (All)'!O$3:O$152,A17))=TRUE,\"\",(SMALL('[2]Day 1 (All)'!O$3:O$152,A17)))","v":14}]
[15,{"$f":"IF(I18=\"\",\"\",IF(ISNA(VLOOKUP($D18,'[2]Teams & Anglers'!$B$7:$F$156,1,FALSE))=TRUE,\"\",VLOOKUP($D18,'[2]Teams & Anglers'!$B$7:$F$1566,4,FALSE)))","v":"TOPPING, Mike"},{"$f":"IF(ISNA(VLOOKUP($D18,'[2]Teams & Anglers'!$B$7:$F$156,1,FALSE))=TRUE,\"\",VLOOKUP($D18,'[2]Teams & Anglers'!$B$7:$F$1566,3,FALSE))","v":115},{"$f":"IF(I18=\"\",\"\",INDEX('[2]Day 1 (All)'!$AA$3:$AA$152,SMALL(IF('[2]Day 1 (All)'!$O$3:$O$152=$I18,ROW('[2]Day 1 (All)'!$O$3:$O$152)-ROW(I$4)+2),COUNTIF($I$4:$I18,$I18))))","v":14},{"$f":"IF($B18=\"\",\"\",IF(ISNA(VLOOKUP($C18,'[2]Day 1 (All)'!$Y$3:$Z$300,1,FALSE))=TRUE,0,VLOOKUP($D18,'[2]Day 1 data entry'!C$3:X$152,19,FALSE)))","v":32},0,10.666666666666666,{"$f":"IF($B18=\"\",\"\",IF(ISNA(VLOOKUP($C18,'[2]Day 1 (All)'!$Y$3:$Z$300,1,FALSE))=TRUE,0,VLOOKUP($D18,'[2]Day 1 data entry'!C$3:X$152,22,FALSE)))","v":"FLOUNDER"},{"$f":"IF(ISERROR(SMALL('[2]Day 1 (All)'!O$3:O$152,A18))=TRUE,\"\",(SMALL('[2]Day 1 (All)'!O$3:O$152,A18)))","v":14}]
[16,{"$f":"IF(I19=\"\",\"\",IF(ISNA(VLOOKUP($D19,'[2]Teams & Anglers'!$B$7:$F$156,1,FALSE))=TRUE,\"\",VLOOKUP($D19,'[2]Teams & Anglers'!$B$7:$F$1566,4,FALSE)))","v":"GOOCH, Mark"},{"$f":"IF(ISNA(VLOOKUP($D19,'[2]Teams & Anglers'!$B$7:$F$156,1,FALSE))=TRUE,\"\",VLOOKUP($D19,'[2]Teams & Anglers'!$B$7:$F$1566,3,FALSE))","v":47},{"$f":"IF(I19=\"\",\"\",INDEX('[2]Day 1 (All)'!$AA$3:$AA$152,SMALL(IF('[2]Day 1 (All)'!$O$3:$O$152=$I19,ROW('[2]Day 1 (All)'!$O$3:$O$152)-ROW(I$4)+2),COUNTIF($I$4:$I19,$I19))))","v":18},{"$f":"IF($B19=\"\",\"\",IF(ISNA(VLOOKUP($C19,'[2]Day 1 (All)'!$Y$3:$Z$300,1,FALSE))=TRUE,0,VLOOKUP($D19,'[2]Day 1 data entry'!C$3:X$152,19,FALSE)))","v":32},0,10.666666666666666,{"$f":"IF($B19=\"\",\"\",IF(ISNA(VLOOKUP($C19,'[2]Day 1 (All)'!$Y$3:$Z$300,1,FALSE))=TRUE,0,VLOOKUP($D19,'[2]Day 1 data entry'!C$3:X$152,22,FALSE)))","v":"FLOUNDER"},{"$f":"IF(ISERROR(SMALL('[2]Day 1 (All)'!O$3:O$152,A19))=TRUE,\"\",(SMALL('[2]Day 1 (All)'!O$3:O$152,A19)))","v":14}]
[17,{"$f":"IF(I20=\"\",\"\",IF(ISNA(VLOOKUP($D20,'[2]Teams & Anglers'!$B$7:$F$156,1,FALSE))=TRUE,\"\",VLOOKUP($D20,'[2]Teams & Anglers'!$B$7:$F$1566,4,FALSE)))","v":"PLUMSTEAD, Joe"},{"$f":"IF(ISNA(VLOOKUP($D20,'[2]Teams & Anglers'!$B$7:$F$156,1,FALSE))=TRUE,\"\",VLOOKUP($D20,'[2]Teams & Anglers'!$B$7:$F$1566,3,FALSE))","v":89},{"$f":"IF(I20=\"\",\"\",INDEX('[2]Day 1 (All)'!$AA$3:$AA$152,SMALL(IF('[2]Day 1 (All)'!$O$3:$O$152=$I20,ROW('[2]Day 1 (All)'!$O$3:$O$152)-ROW(I$4)+2),COUNTIF($I$4:$I20,$I20))))","v":20},{"$f":"IF($B20=\"\",\"\",IF(ISNA(VLOOKUP($C20,'[2]Day 1 (All)'!$Y$3:$Z$300,1,FALSE))=TRUE,0,VLOOKUP($D20,'[2]Day 1 data entry'!C$3:X$152,19,FALSE)))","v":32},0,10.666666666666666,{"$f":"IF($B20=\"\",\"\",IF(ISNA(VLOOKUP($C20,'[2]Day 1 (All)'!$Y$3:$Z$300,1,FALSE))=TRUE,0,VLOOKUP($D20,'[2]Day 1 data entry'!C$3:X$152,22,FALSE)))","v":"FLOUNDER"},{"$f":"IF(ISERROR(SMALL('[2]Day 1 (All)'!O$3:O$152,A20))=TRUE,\"\",(SMALL('[2]Day 1 (All)'!O$3:O$152,A20)))","v":14}]
[18,{"$f":"IF(I21=\"\",\"\",IF(ISNA(VLOOKUP($D21,'[2]Teams & Anglers'!$B$7:$F$156,1,FALSE))=TRUE,\"\",VLOOKUP($D21,'[2]Teams & Anglers'!$B$7:$F$1566,4,FALSE)))","v":"HIPPERSON, Richard"},{"$f":"IF(ISNA(VLOOKUP($D21,'[2]Teams & Anglers'!$B$7:$F$156,1,FALSE))=TRUE,\"\",VLOOKUP($D21,'[2]Teams & Anglers'!$B$7:$F$1566,3,FALSE))","v":57},{"$f":"IF(I21=\"\",\"\",INDEX('[2]Day 1 (All)'!$AA$3:$AA$152,SMALL(IF('[2]Day 1 (All)'!$O$3:$O$152=$I21,ROW('[2]Day 1 (All)'!$O$3:$O$152)-ROW(I$4)+2),COUNTIF($I$4:$I21,$I21))))","v":7},{"$f":"IF($B21=\"\",\"\",IF(ISNA(VLOOKUP($C21,'[2]Day 1 (All)'!$Y$3:$Z$300,1,FALSE))=TRUE,0,VLOOKUP($D21,'[2]Day 1 data entry'!C$3:X$152,19,FALSE)))","v":28},0,9.3333333333333339,{"$f":"IF($B21=\"\",\"\",IF(ISNA(VLOOKUP($C21,'[2]Day 1 (All)'!$Y$3:$Z$300,1,FALSE))=TRUE,0,VLOOKUP($D21,'[2]Day 1 data entry'!C$3:X$152,22,FALSE)))","v":"FLOUNDER"},{"$f":"IF(ISERROR(SMALL('[2]Day 1 (All)'!O$3:O$152,A21))=TRUE,\"\",(SMALL('[2]Day 1 (All)'!O$3:O$152,A21)))","v":18}]
[19,{"$f":"IF(I22=\"\",\"\",IF(ISNA(VLOOKUP($D22,'[2]Teams & Anglers'!$B$7:$F$156,1,FALSE))=TRUE,\"\",VLOOKUP($D22,'[2]Teams & Anglers'!$B$7:$F$1566,4,FALSE)))","v":"TOPPING, Jack"},{"$f":"IF(ISNA(VLOOKUP($D22,'[2]Teams & Anglers'!$B$7:$F$156,1,FALSE))=TRUE,\"\",VLOOKUP($D22,'[2]Teams & Anglers'!$B$7:$F$1566,3,FALSE))","v":114},{"$f":"IF(I22=\"\",\"\",INDEX('[2]Day 1 (All)'!$AA$3:$AA$152,SMALL(IF('[2]Day 1 (All)'!$O$3:$O$152=$I22,ROW('[2]Day 1 (All)'!$O$3:$O$152)-ROW(I$4)+2),COUNTIF($I$4:$I22,$I22))))","v":13},{"$f":"IF($B22=\"\",\"\",IF(ISNA(VLOOKUP($C22,'[2]Day 1 (All)'!$Y$3:$Z$300,1,FALSE))=TRUE,0,VLOOKUP($D22,'[2]Day 1 data entry'!C$3:X$152,19,FALSE)))","v":28},0,9.3333333333333339,{"$f":"IF($B22=\"\",\"\",IF(ISNA(VLOOKUP($C22,'[2]Day 1 (All)'!$Y$3:$Z$300,1,FALSE))=TRUE,0,VLOOKUP($D22,'[2]Day 1 data entry'!C$3:X$152,22,FALSE)))","v":"FLOUNDER"},{"$f":"IF(ISERROR(SMALL('[2]Day 1 (All)'!O$3:O$152,A22))=TRUE,\"\",(SMALL('[2]Day 1 (All)'!O$3:O$152,A22)))","v":18}]
[20,{"$f":"IF(I23=\"\",\"\",IF(ISNA(VLOOKUP($D23,'[2]Teams & Anglers'!$B$7:$F$156,1,FALSE))=TRUE,\"\",VLOOKUP($D23,'[2]Teams & Anglers'!$B$7:$F$1566,4,FALSE)))","v":"BURT, Richard"},{"$f":"IF(ISNA(VLOOKUP($D23,'[2]Teams & Anglers'!$B$7:$F$156,1,FALSE))=TRUE,\"\",VLOOKUP($D23,'[2]Teams & Anglers'!$B$7:$F$1566,3,FALSE))","v":20},{"$f":"IF(I23=\"\",\"\",INDEX('[2]Day 1 (All)'!$AA$3:$AA$152,SMALL(IF('[2]Day 1 (All)'!$O$3:$O$152=$I23,ROW('[2]Day 1 (All)'!$O$3:$O$152)-ROW(I$4)+2),COUNTIF($I$4:$I23,$I23))))","v":16},{"$f":"IF($B23=\"\",\"\",IF(ISNA(VLOOKUP($C23,'[2]Day 1 (All)'!$Y$3:$Z$300,1,FALSE))=TRUE,0,VLOOKUP($D23,'[2]Day 1 data entry'!C$3:X$152,19,FALSE)))","v":28},0,9.3333333333333339,{"$f":"IF($B23=\"\",\"\",IF(ISNA(VLOOKUP($C23,'[2]Day 1 (All)'!$Y$3:$Z$300,1,FALSE))=TRUE,0,VLOOKUP($D23,'[2]Day 1 data entry'!C$3:X$152,22,FALSE)))","v":"FLOUNDER"},{"$f":"IF(ISERROR(SMALL('[2]Day 1 (All)'!O$3:O$152,A23))=TRUE,\"\",(SMALL('[2]Day 1 (All)'!O$3:O$152,A23)))","v":18}]
[21,{"$f":"IF(I24=\"\",\"\",IF(ISNA(VLOOKUP($D24,'[2]Teams & Anglers'!$B$7:$F$156,1,FALSE))=TRUE,\"\",VLOOKUP($D24,'[2]Teams & Anglers'!$B$7:$F$1566,4,FALSE)))","v":"EDWARDS, Lee"},{"$f":"IF(ISNA(VLOOKUP($D24,'[2]Teams & Anglers'!$B$7:$F$156,1,FALSE))=TRUE,\"\",VLOOKUP($D24,'[2]Teams & Anglers'!$B$7:$F$1566,3,FALSE))","v":37},{"$f":"IF(I24=\"\",\"\",INDEX('[2]Day 1 (All)'!$AA$3:$AA$152,SMALL(IF('[2]Day 1 (All)'!$O$3:$O$152=$I24,ROW('[2]Day 1 (All)'!$O$3:$O$152)-ROW(I$4)+2),COUNTIF($I$4:$I24,$I24))))","v":17},{"$f":"IF($B24=\"\",\"\",IF(ISNA(VLOOKUP($C24,'[2]Day 1 (All)'!$Y$3:$Z$300,1,FALSE))=TRUE,0,VLOOKUP($D24,'[2]Day 1 data entry'!C$3:X$152,19,FALSE)))","v":28},0,9.3333333333333339,{"$f":"IF($B24=\"\",\"\",IF(ISNA(VLOOKUP($C24,'[2]Day 1 (All)'!$Y$3:$Z$300,1,FALSE))=TRUE,0,VLOOKUP($D24,'[2]Day 1 data entry'!C$3:X$152,22,FALSE)))","v":"FLOUNDER"},{"$f":"IF(ISERROR(SMALL('[2]Day 1 (All)'!O$3:O$152,A24))=TRUE,\"\",(SMALL('[2]Day 1 (All)'!O$3:O$152,A24)))","v":18}]
[22,{"$f":"IF(I25=\"\",\"\",IF(ISNA(VLOOKUP($D25,'[2]Teams & Anglers'!$B$7:$F$156,1,FALSE))=TRUE,\"\",VLOOKUP($D25,'[2]Teams & Anglers'!$B$7:$F$1566,4,FALSE)))","v":"THORPE, Doug"},{"$f":"IF(ISNA(VLOOKUP($D25,'[2]Teams & Anglers'!$B$7:$F$156,1,FALSE))=TRUE,\"\",VLOOKUP($D25,'[2]Teams & Anglers'!$B$7:$F$1566,3,FALSE))","v":113},{"$f":"IF(I25=\"\",\"\",INDEX('[2]Day 1 (All)'!$AA$3:$AA$152,SMALL(IF('[2]Day 1 (All)'!$O$3:$O$152=$I25,ROW('[2]Day 1 (All)'!$O$3:$O$152)-ROW(I$4)+2),COUNTIF($I$4:$I25,$I25))))","v":19},{"$f":"IF($B25=\"\",\"\",IF(ISNA(VLOOKUP($C25,'[2]Day 1 (All)'!$Y$3:$Z$300,1,FALSE))=TRUE,0,VLOOKUP($D25,'[2]Day 1 data entry'!C$3:X$152,19,FALSE)))","v":24},0,8,{"$f":"IF($B25=\"\",\"\",IF(ISNA(VLOOKUP($C25,'[2]Day 1 (All)'!$Y$3:$Z$300,1,FALSE))=TRUE,0,VLOOKUP($D25,'[2]Day 1 data entry'!C$3:X$152,22,FALSE)))","v":"DAB"},{"$f":"IF(ISERROR(SMALL('[2]Day 1 (All)'!O$3:O$152,A25))=TRUE,\"\",(SMALL('[2]Day 1 (All)'!O$3:O$152,A25)))","v":22}]
[23,{"$f":"IF(I26=\"\",\"\",IF(ISNA(VLOOKUP($D26,'[2]Teams & Anglers'!$B$7:$F$156,1,FALSE))=TRUE,\"\",VLOOKUP($D26,'[2]Teams & Anglers'!$B$7:$F$1566,4,FALSE)))","v":"ROGERS, Mark"},{"$f":"IF(ISNA(VLOOKUP($D26,'[2]Teams & Anglers'!$B$7:$F$156,1,FALSE))=TRUE,\"\",VLOOKUP($D26,'[2]Teams & Anglers'!$B$7:$F$1566,3,FALSE))","v":95},{"$f":"IF(I26=\"\",\"\",INDEX('[2]Day 1 (All)'!$AA$3:$AA$152,SMALL(IF('[2]Day 1 (All)'!$O$3:$O$152=$I26,ROW('[2]Day 1 (All)'!$O$3:$O$152)-ROW(I$4)+2),COUNTIF($I$4:$I26,$I26))))","v":21},{"$f":"IF($B26=\"\",\"\",IF(ISNA(VLOOKUP($C26,'[2]Day 1 (All)'!$Y$3:$Z$300,1,FALSE))=TRUE,0,VLOOKUP($D26,'[2]Day 1 data entry'!C$3:X$152,19,FALSE)))","v":21},0,7,{"$f":"IF($B26=\"\",\"\",IF(ISNA(VLOOKUP($C26,'[2]Day 1 (All)'!$Y$3:$Z$300,1,FALSE))=TRUE,0,VLOOKUP($D26,'[2]Day 1 data entry'!C$3:X$152,22,FALSE)))","v":"FLOUNDER"},{"$f":"IF(ISERROR(SMALL('[2]Day 1 (All)'!O$3:O$152,A26))=TRUE,\"\",(SMALL('[2]Day 1 (All)'!O$3:O$152,A26)))","v":23}]
[24,{"$f":"IF(I27=\"\",\"\",IF(ISNA(VLOOKUP($D27,'[2]Teams & Anglers'!$B$7:$F$156,1,FALSE))=TRUE,\"\",VLOOKUP($D27,'[2]Teams & Anglers'!$B$7:$F$1566,4,FALSE)))","v":"PRICE, Jimmy"},{"$f":"IF(ISNA(VLOOKUP($D27,'[2]Teams & Anglers'!$B$7:$F$156,1,FALSE))=TRUE,\"\",VLOOKUP($D27,'[2]Teams & Anglers'!$B$7:$F$1566,3,FALSE))","v":92},{"$f":"IF(I27=\"\",\"\",INDEX('[2]Day 1 (All)'!$AA$3:$AA$152,SMALL(IF('[2]Day 1 (All)'!$O$3:$O$152=$I27,ROW('[2]Day 1 (All)'!$O$3:$O$152)-ROW(I$4)+2),COUNTIF($I$4:$I27,$I27))))","v":66},{"$f":"IF($B27=\"\",\"\",IF(ISNA(VLOOKUP($C27,'[2]Day 1 (All)'!$Y$3:$Z$300,1,FALSE))=TRUE,0,VLOOKUP($D27,'[2]Day 1 data entry'!C$3:X$152,19,FALSE)))","v":21},0,7,{"$f":"IF($B27=\"\",\"\",IF(ISNA(VLOOKUP($C27,'[2]Day 1 (All)'!$Y$3:$Z$300,1,FALSE))=TRUE,0,VLOOKUP($D27,'[2]Day 1 data entry'!C$3:X$152,22,FALSE)))","v":"FLOUNDER"},{"$f":"IF(ISERROR(SMALL('[2]Day 1 (All)'!O$3:O$152,A27))=TRUE,\"\",(SMALL('[2]Day 1 (All)'!O$3:O$152,A27)))","v":23}]
[25,{"$f":"IF(I28=\"\",\"\",IF(ISNA(VLOOKUP($D28,'[2]Teams & Anglers'!$B$7:$F$156,1,FALSE))=TRUE,\"\",VLOOKUP($D28,'[2]Teams & Anglers'!$B$7:$F$1566,4,FALSE)))","v":"NANGLE, Karl"},{"$f":"IF(ISNA(VLOOKUP($D28,'[2]Teams & Anglers'!$B$7:$F$156,1,FALSE))=TRUE,\"\",VLOOKUP($D28,'[2]Teams & Anglers'!$B$7:$F$1566,3,FALSE))","v":78},{"$f":"IF(I28=\"\",\"\",INDEX('[2]Day 1 (All)'!$AA$3:$AA$152,SMALL(IF('[2]Day 1 (All)'!$O$3:$O$152=$I28,ROW('[2]Day 1 (All)'!$O$3:$O$152)-ROW(I$4)+2),COUNTIF($I$4:$I28,$I28))))","v":69},{"$f":"IF($B28=\"\",\"\",IF(ISNA(VLOOKUP($C28,'[2]Day 1 (All)'!$Y$3:$Z$300,1,FALSE))=TRUE,0,VLOOKUP($D28,'[2]Day 1 data entry'!C$3:X$152,19,FALSE)))","v":21},0,7,{"$f":"IF($B28=\"\",\"\",IF(ISNA(VLOOKUP($C28,'[2]Day 1 (All)'!$Y$3:$Z$300,1,FALSE))=TRUE,0,VLOOKUP($D28,'[2]Day 1 data entry'!C$3:X$152,22,FALSE)))","v":"DAB"},{"$f":"IF(ISERROR(SMALL('[2]Day 1 (All)'!O$3:O$152,A28))=TRUE,\"\",(SMALL('[2]Day 1 (All)'!O$3:O$152,A28)))","v":23}]
[26,{"$f":"IF(I29=\"\",\"\",IF(ISNA(VLOOKUP($D29,'[2]Teams & Anglers'!$B$7:$F$156,1,FALSE))=TRUE,\"\",VLOOKUP($D29,'[2]Teams & Anglers'!$B$7:$F$1566,4,FALSE)))","v":"TURNER, Cameron"},{"$f":"IF(ISNA(VLOOKUP($D29,'[2]Teams & Anglers'!$B$7:$F$156,1,FALSE))=TRUE,\"\",VLOOKUP($D29,'[2]Teams & Anglers'!$B$7:$F$1566,3,FALSE))","v":117},{"$f":"IF(I29=\"\",\"\",INDEX('[2]Day 1 (All)'!$AA$3:$AA$152,SMALL(IF('[2]Day 1 (All)'!$O$3:$O$152=$I29,ROW('[2]Day 1 (All)'!$O$3:$O$152)-ROW(I$4)+2),COUNTIF($I$4:$I29,$I29))))","v":71},{"$f":"IF($B29=\"\",\"\",IF(ISNA(VLOOKUP($C29,'[2]Day 1 (All)'!$Y$3:$Z$300,1,FALSE))=TRUE,0,VLOOKUP($D29,'[2]Day 1 data entry'!C$3:X$152,19,FALSE)))","v":21},0,7,{"$f":"IF($B29=\"\",\"\",IF(ISNA(VLOOKUP($C29,'[2]Day 1 (All)'!$Y$3:$Z$300,1,FALSE))=TRUE,0,VLOOKUP($D29,'[2]Day 1 data entry'!C$3:X$152,22,FALSE)))","v":"FLOUNDER"},{"$f":"IF(ISERROR(SMALL('[2]Day 1 (All)'!O$3:O$152,A29))=TRUE,\"\",(SMALL('[2]Day 1 (All)'!O$3:O$152,A29)))","v":23}]
[27,{"$f":"IF(I30=\"\",\"\",IF(ISNA(VLOOKUP($D30,'[2]Teams & Anglers'!$B$7:$F$156,1,FALSE))=TRUE,\"\",VLOOKUP($D30,'[2]Teams & Anglers'!$B$7:$F$1566,4,FALSE)))","v":"FALK, Dave"},{"$f":"IF(ISNA(VLOOKUP($D30,'[2]Teams & Anglers'!$B$7:$F$156,1,FALSE))=TRUE,\"\",VLOOKUP($D30,'[2]Teams & Anglers'!$B$7:$F$1566,3,FALSE))","v":39},{"$f":"IF(I30=\"\",\"\",INDEX('[2]Day 1 (All)'!$AA$3:$AA$152,SMALL(IF('[2]Day 1 (All)'!$O$3:$O$152=$I30,ROW('[2]Day 1 (All)'!$O$3:$O$152)-ROW(I$4)+2),COUNTIF($I$4:$I30,$I30))))","v":99},{"$f":"IF($B30=\"\",\"\",IF(ISNA(VLOOKUP($C30,'[2]Day 1 (All)'!$Y$3:$Z$300,1,FALSE))=TRUE,0,VLOOKUP($D30,'[2]Day 1 data entry'!C$3:X$152,19,FALSE)))","v":21},0,7,{"$f":"IF($B30=\"\",\"\",IF(ISNA(VLOOKUP($C30,'[2]Day 1 (All)'!$Y$3:$Z$300,1,FALSE))=TRUE,0,VLOOKUP($D30,'[2]Day 1 data entry'!C$3:X$152,22,FALSE)))","v":"DAB"},{"$f":"IF(ISERROR(SMALL('[2]Day 1 (All)'!O$3:O$152,A30))=TRUE,\"\",(SMALL('[2]Day 1 (All)'!O$3:O$152,A30)))","v":23}]
[28,{"$f":"IF(I31=\"\",\"\",IF(ISNA(VLOOKUP($D31,'[2]Teams & Anglers'!$B$7:$F$156,1,FALSE))=TRUE,\"\",VLOOKUP($D31,'[2]Teams & Anglers'!$B$7:$F$1566,4,FALSE)))","v":"LEE, Martin"},{"$f":"IF(ISNA(VLOOKUP($D31,'[2]Teams & Anglers'!$B$7:$F$156,1,FALSE))=TRUE,\"\",VLOOKUP($D31,'[2]Teams & Anglers'!$B$7:$F$1566,3,FALSE))","v":68},{"$f":"IF(I31=\"\",\"\",INDEX('[2]Day 1 (All)'!$AA$3:$AA$152,SMALL(IF('[2]Day 1 (All)'!$O$3:$O$152=$I31,ROW('[2]Day 1 (All)'!$O$3:$O$152)-ROW(I$4)+2),COUNTIF($I$4:$I31,$I31))))","v":120},{"$f":"IF($B31=\"\",\"\",IF(ISNA(VLOOKUP($C31,'[2]Day 1 (All)'!$Y$3:$Z$300,1,FALSE))=TRUE,0,VLOOKUP($D31,'[2]Day 1 data entry'!C$3:X$152,19,FALSE)))","v":21},0,7,{"$f":"IF($B31=\"\",\"\",IF(ISNA(VLOOKUP($C31,'[2]Day 1 (All)'!$Y$3:$Z$300,1,FALSE))=TRUE,0,VLOOKUP($D31,'[2]Day 1 data entry'!C$3:X$152,22,FALSE)))","v":"FLOUNDER"},{"$f":"IF(ISERROR(SMALL('[2]Day 1 (All)'!O$3:O$152,A31))=TRUE,\"\",(SMALL('[2]Day 1 (All)'!O$3:O$152,A31)))","v":23}]
[29,{"$f":"IF(I32=\"\",\"\",IF(ISNA(VLOOKUP($D32,'[2]Teams & Anglers'!$B$7:$F$156,1,FALSE))=TRUE,\"\",VLOOKUP($D32,'[2]Teams & Anglers'!$B$7:$F$1566,4,FALSE)))","v":"ROYALL, Tony "},{"$f":"IF(ISNA(VLOOKUP($D32,'[2]Teams & Anglers'!$B$7:$F$156,1,FALSE))=TRUE,\"\",VLOOKUP($D32,'[2]Teams & Anglers'!$B$7:$F$1566,3,FALSE))","v":97},{"$f":"IF(I32=\"\",\"\",INDEX('[2]Day 1 (All)'!$AA$3:$AA$152,SMALL(IF('[2]Day 1 (All)'!$O$3:$O$152=$I32,ROW('[2]Day 1 (All)'!$O$3:$O$152)-ROW(I$4)+2),COUNTIF($I$4:$I32,$I32))))","v":123},{"$f":"IF($B32=\"\",\"\",IF(ISNA(VLOOKUP($C32,'[2]Day 1 (All)'!$Y$3:$Z$300,1,FALSE))=TRUE,0,VLOOKUP($D32,'[2]Day 1 data entry'!C$3:X$152,19,FALSE)))","v":21},0,7,{"$f":"IF($B32=\"\",\"\",IF(ISNA(VLOOKUP($C32,'[2]Day 1 (All)'!$Y$3:$Z$300,1,FALSE))=TRUE,0,VLOOKUP($D32,'[2]Day 1 data entry'!C$3:X$152,22,FALSE)))","v":"DAB"},{"$f":"IF(ISERROR(SMALL('[2]Day 1 (All)'!O$3:O$152,A32))=TRUE,\"\",(SMALL('[2]Day 1 (All)'!O$3:O$152,A32)))","v":23}]
[30,{"$f":"IF(I33=\"\",\"\",IF(ISNA(VLOOKUP($D33,'[2]Teams & Anglers'!$B$7:$F$156,1,FALSE))=TRUE,\"\",VLOOKUP($D33,'[2]Teams & Anglers'!$B$7:$F$1566,4,FALSE)))","v":"CUTLER, Neil"},{"$f":"IF(ISNA(VLOOKUP($D33,'[2]Teams & Anglers'!$B$7:$F$156,1,FALSE))=TRUE,\"\",VLOOKUP($D33,'[2]Teams & Anglers'!$B$7:$F$1566,3,FALSE))","v":30},{"$f":"IF(I33=\"\",\"\",INDEX('[2]Day 1 (All)'!$AA$3:$AA$152,SMALL(IF('[2]Day 1 (All)'!$O$3:$O$152=$I33,ROW('[2]Day 1 (All)'!$O$3:$O$152)-ROW(I$4)+2),COUNTIF($I$4:$I33,$I33))))","v":127},{"$f":"IF($B33=\"\",\"\",IF(ISNA(VLOOKUP($C33,'[2]Day 1 (All)'!$Y$3:$Z$300,1,FALSE))=TRUE,0,VLOOKUP($D33,'[2]Day 1 data entry'!C$3:X$152,19,FALSE)))","v":21},0,7,{"$f":"IF($B33=\"\",\"\",IF(ISNA(VLOOKUP($C33,'[2]Day 1 (All)'!$Y$3:$Z$300,1,FALSE))=TRUE,0,VLOOKUP($D33,'[2]Day 1 data entry'!C$3:X$152,22,FALSE)))","v":"DAB"},{"$f":"IF(ISERROR(SMALL('[2]Day 1 (All)'!O$3:O$152,A33))=TRUE,\"\",(SMALL('[2]Day 1 (All)'!O$3:O$152,A33)))","v":23}]
[31,{"$f":"IF(I34=\"\",\"\",IF(ISNA(VLOOKUP($D34,'[2]Teams & Anglers'!$B$7:$F$156,1,FALSE))=TRUE,\"\",VLOOKUP($D34,'[2]Teams & Anglers'!$B$7:$F$1566,4,FALSE)))","v":"GALLACHER, Andy"},{"$f":"IF(ISNA(VLOOKUP($D34,'[2]Teams & Anglers'!$B$7:$F$156,1,FALSE))=TRUE,\"\",VLOOKUP($D34,'[2]Teams & Anglers'!$B$7:$F$1566,3,FALSE))","v":43},{"$f":"IF(I34=\"\",\"\",INDEX('[2]Day 1 (All)'!$AA$3:$AA$152,SMALL(IF('[2]Day 1 (All)'!$O$3:$O$152=$I34,ROW('[2]Day 1 (All)'!$O$3:$O$152)-ROW(I$4)+2),COUNTIF($I$4:$I34,$I34))))","v":11},{"$f":"IF($B34=\"\",\"\",IF(ISNA(VLOOKUP($C34,'[2]Day 1 (All)'!$Y$3:$Z$300,1,FALSE))=TRUE,0,VLOOKUP($D34,'[2]Day 1 data entry'!C$3:X$152,19,FALSE)))","v":18},0,6,{"$f":"IF($B34=\"\",\"\",IF(ISNA(VLOOKUP($C34,'[2]Day 1 (All)'!$Y$3:$Z$300,1,FALSE))=TRUE,0,VLOOKUP($D34,'[2]Day 1 data entry'!C$3:X$152,22,FALSE)))","v":"DAB"},{"$f":"IF(ISERROR(SMALL('[2]Day 1 (All)'!O$3:O$152,A34))=TRUE,\"\",(SMALL('[2]Day 1 (All)'!O$3:O$152,A34)))","v":31}]
[32,{"$f":"IF(I35=\"\",\"\",IF(ISNA(VLOOKUP($D35,'[2]Teams & Anglers'!$B$7:$F$156,1,FALSE))=TRUE,\"\",VLOOKUP($D35,'[2]Teams & Anglers'!$B$7:$F$1566,4,FALSE)))","v":"FRARY, Charlie"},{"$f":"IF(ISNA(VLOOKUP($D35,'[2]Teams & Anglers'!$B$7:$F$156,1,FALSE))=TRUE,\"\",VLOOKUP($D35,'[2]Teams & Anglers'!$B$7:$F$1566,3,FALSE))","v":40},{"$f":"IF(I35=\"\",\"\",INDEX('[2]Day 1 (All)'!$AA$3:$AA$152,SMALL(IF('[2]Day 1 (All)'!$O$3:$O$152=$I35,ROW('[2]Day 1 (All)'!$O$3:$O$152)-ROW(I$4)+2),COUNTIF($I$4:$I35,$I35))))","v":27},{"$f":"IF($B35=\"\",\"\",IF(ISNA(VLOOKUP($C35,'[2]Day 1 (All)'!$Y$3:$Z$300,1,FALSE))=TRUE,0,VLOOKUP($D35,'[2]Day 1 data entry'!C$3:X$152,19,FALSE)))","v":18},0,6,{"$f":"IF($B35=\"\",\"\",IF(ISNA(VLOOKUP($C35,'[2]Day 1 (All)'!$Y$3:$Z$300,1,FALSE))=TRUE,0,VLOOKUP($D35,'[2]Day 1 data entry'!C$3:X$152,22,FALSE)))","v":"DAB"},{"$f":"IF(ISERROR(SMALL('[2]Day 1 (All)'!O$3:O$152,A35))=TRUE,\"\",(SMALL('[2]Day 1 (All)'!O$3:O$152,A35)))","v":31}]
[33,{"$f":"IF(I36=\"\",\"\",IF(ISNA(VLOOKUP($D36,'[2]Teams & Anglers'!$B$7:$F$156,1,FALSE))=TRUE,\"\",VLOOKUP($D36,'[2]Teams & Anglers'!$B$7:$F$1566,4,FALSE)))","v":"DAWBER, Simon"},{"$f":"IF(ISNA(VLOOKUP($D36,'[2]Teams & Anglers'!$B$7:$F$156,1,FALSE))=TRUE,\"\",VLOOKUP($D36,'[2]Teams & Anglers'!$B$7:$F$1566,3,FALSE))","v":31},{"$f":"IF(I36=\"\",\"\",INDEX('[2]Day 1 (All)'!$AA$3:$AA$152,SMALL(IF('[2]Day 1 (All)'!$O$3:$O$152=$I36,ROW('[2]Day 1 (All)'!$O$3:$O$152)-ROW(I$4)+2),COUNTIF($I$4:$I36,$I36))))","v":35},{"$f":"IF($B36=\"\",\"\",IF(ISNA(VLOOKUP($C36,'[2]Day 1 (All)'!$Y$3:$Z$300,1,FALSE))=TRUE,0,VLOOKUP($D36,'[2]Day 1 data entry'!C$3:X$152,19,FALSE)))","v":18},0,6,{"$f":"IF($B36=\"\",\"\",IF(ISNA(VLOOKUP($C36,'[2]Day 1 (All)'!$Y$3:$Z$300,1,FALSE))=TRUE,0,VLOOKUP($D36,'[2]Day 1 data entry'!C$3:X$152,22,FALSE)))","v":"DAB"},{"$f":"IF(ISERROR(SMALL('[2]Day 1 (All)'!O$3:O$152,A36))=TRUE,\"\",(SMALL('[2]Day 1 (All)'!O$3:O$152,A36)))","v":31}]
[34,{"$f":"IF(I37=\"\",\"\",IF(ISNA(VLOOKUP($D37,'[2]Teams & Anglers'!$B$7:$F$156,1,FALSE))=TRUE,\"\",VLOOKUP($D37,'[2]Teams & Anglers'!$B$7:$F$1566,4,FALSE)))","v":"COOPER, Phillip"},{"$f":"IF(ISNA(VLOOKUP($D37,'[2]Teams & Anglers'!$B$7:$F$156,1,FALSE))=TRUE,\"\",VLOOKUP($D37,'[2]Teams & Anglers'!$B$7:$F$1566,3,FALSE))","v":24},{"$f":"IF(I37=\"\",\"\",INDEX('[2]Day 1 (All)'!$AA$3:$AA$152,SMALL(IF('[2]Day 1 (All)'!$O$3:$O$152=$I37,ROW('[2]Day 1 (All)'!$O$3:$O$152)-ROW(I$4)+2),COUNTIF($I$4:$I37,$I37))))","v":54},{"$f":"IF($B37=\"\",\"\",IF(ISNA(VLOOKUP($C37,'[2]Day 1 (All)'!$Y$3:$Z$300,1,FALSE))=TRUE,0,VLOOKUP($D37,'[2]Day 1 data entry'!C$3:X$152,19,FALSE)))","v":18},0,6,{"$f":"IF($B37=\"\",\"\",IF(ISNA(VLOOKUP($C37,'[2]Day 1 (All)'!$Y$3:$Z$300,1,FALSE))=TRUE,0,VLOOKUP($D37,'[2]Day 1 data entry'!C$3:X$152,22,FALSE)))","v":"DAB"},{"$f":"IF(ISERROR(SMALL('[2]Day 1 (All)'!O$3:O$152,A37))=TRUE,\"\",(SMALL('[2]Day 1 (All)'!O$3:O$152,A37)))","v":31}]
[35,{"$f":"IF(I38=\"\",\"\",IF(ISNA(VLOOKUP($D38,'[2]Teams & Anglers'!$B$7:$F$156,1,FALSE))=TRUE,\"\",VLOOKUP($D38,'[2]Teams & Anglers'!$B$7:$F$1566,4,FALSE)))","v":"WATTS, Mike"},{"$f":"IF(ISNA(VLOOKUP($D38,'[2]Teams & Anglers'!$B$7:$F$156,1,FALSE))=TRUE,\"\",VLOOKUP($D38,'[2]Teams & Anglers'!$B$7:$F$1566,3,FALSE))","v":119},{"$f":"IF(I38=\"\",\"\",INDEX('[2]Day 1 (All)'!$AA$3:$AA$152,SMALL(IF('[2]Day 1 (All)'!$O$3:$O$152=$I38,ROW('[2]Day 1 (All)'!$O$3:$O$152)-ROW(I$4)+2),COUNTIF($I$4:$I38,$I38))))","v":61},{"$f":"IF($B38=\"\",\"\",IF(ISNA(VLOOKUP($C38,'[2]Day 1 (All)'!$Y$3:$Z$300,1,FALSE))=TRUE,0,VLOOKUP($D38,'[2]Day 1 data entry'!C$3:X$152,19,FALSE)))","v":18},0,6,{"$f":"IF($B38=\"\",\"\",IF(ISNA(VLOOKUP($C38,'[2]Day 1 (All)'!$Y$3:$Z$300,1,FALSE))=TRUE,0,VLOOKUP($D38,'[2]Day 1 data entry'!C$3:X$152,22,FALSE)))","v":"FLOUNDER"},{"$f":"IF(ISERROR(SMALL('[2]Day 1 (All)'!O$3:O$152,A38))=TRUE,\"\",(SMALL('[2]Day 1 (All)'!O$3:O$152,A38)))","v":31}]
[36,{"$f":"IF(I39=\"\",\"\",IF(ISNA(VLOOKUP($D39,'[2]Teams & Anglers'!$B$7:$F$156,1,FALSE))=TRUE,\"\",VLOOKUP($D39,'[2]Teams & Anglers'!$B$7:$F$1566,4,FALSE)))","v":"BOND, Darren"},{"$f":"IF(ISNA(VLOOKUP($D39,'[2]Teams & Anglers'!$B$7:$F$156,1,FALSE))=TRUE,\"\",VLOOKUP($D39,'[2]Teams & Anglers'!$B$7:$F$1566,3,FALSE))","v":13},{"$f":"IF(I39=\"\",\"\",INDEX('[2]Day 1 (All)'!$AA$3:$AA$152,SMALL(IF('[2]Day 1 (All)'!$O$3:$O$152=$I39,ROW('[2]Day 1 (All)'!$O$3:$O$152)-ROW(I$4)+2),COUNTIF($I$4:$I39,$I39))))","v":63},{"$f":"IF($B39=\"\",\"\",IF(ISNA(VLOOKUP($C39,'[2]Day 1 (All)'!$Y$3:$Z$300,1,FALSE))=TRUE,0,VLOOKUP($D39,'[2]Day 1 data entry'!C$3:X$152,19,FALSE)))","v":18},0,6,{"$f":"IF($B39=\"\",\"\",IF(ISNA(VLOOKUP($C39,'[2]Day 1 (All)'!$Y$3:$Z$300,1,FALSE))=TRUE,0,VLOOKUP($D39,'[2]Day 1 data entry'!C$3:X$152,22,FALSE)))","v":"DAB"},{"$f":"IF(ISERROR(SMALL('[2]Day 1 (All)'!O$3:O$152,A39))=TRUE,\"\",(SMALL('[2]Day 1 (All)'!O$3:O$152,A39)))","v":31}]
[37,{"$f":"IF(I40=\"\",\"\",IF(ISNA(VLOOKUP($D40,'[2]Teams & Anglers'!$B$7:$F$156,1,FALSE))=TRUE,\"\",VLOOKUP($D40,'[2]Teams & Anglers'!$B$7:$F$1566,4,FALSE)))","v":"WHITE, Alan"},{"$f":"IF(ISNA(VLOOKUP($D40,'[2]Teams & Anglers'!$B$7:$F$156,1,FALSE))=TRUE,\"\",VLOOKUP($D40,'[2]Teams & Anglers'!$B$7:$F$1566,3,FALSE))","v":121},{"$f":"IF(I40=\"\",\"\",INDEX('[2]Day 1 (All)'!$AA$3:$AA$152,SMALL(IF('[2]Day 1 (All)'!$O$3:$O$152=$I40,ROW('[2]Day 1 (All)'!$O$3:$O$152)-ROW(I$4)+2),COUNTIF($I$4:$I40,$I40))))","v":81},{"$f":"IF($B40=\"\",\"\",IF(ISNA(VLOOKUP($C40,'[2]Day 1 (All)'!$Y$3:$Z$300,1,FALSE))=TRUE,0,VLOOKUP($D40,'[2]Day 1 data entry'!C$3:X$152,19,FALSE)))","v":18},0,6,{"$f":"IF($B40=\"\",\"\",IF(ISNA(VLOOKUP($C40,'[2]Day 1 (All)'!$Y$3:$Z$300,1,FALSE))=TRUE,0,VLOOKUP($D40,'[2]Day 1 data entry'!C$3:X$152,22,FALSE)))","v":"DAB"},{"$f":"IF(ISERROR(SMALL('[2]Day 1 (All)'!O$3:O$152,A40))=TRUE,\"\",(SMALL('[2]Day 1 (All)'!O$3:O$152,A40)))","v":31}]
[38,{"$f":"IF(I41=\"\",\"\",IF(ISNA(VLOOKUP($D41,'[2]Teams & Anglers'!$B$7:$F$156,1,FALSE))=TRUE,\"\",VLOOKUP($D41,'[2]Teams & Anglers'!$B$7:$F$1566,4,FALSE)))","v":"ALDOUS, David"},{"$f":"IF(ISNA(VLOOKUP($D41,'[2]Teams & Anglers'!$B$7:$F$156,1,FALSE))=TRUE,\"\",VLOOKUP($D41,'[2]Teams & Anglers'!$B$7:$F$1566,3,FALSE))","v":5},{"$f":"IF(I41=\"\",\"\",INDEX('[2]Day 1 (All)'!$AA$3:$AA$152,SMALL(IF('[2]Day 1 (All)'!$O$3:$O$152=$I41,ROW('[2]Day 1 (All)'!$O$3:$O$152)-ROW(I$4)+2),COUNTIF($I$4:$I41,$I41))))","v":93},{"$f":"IF($B41=\"\",\"\",IF(ISNA(VLOOKUP($C41,'[2]Day 1 (All)'!$Y$3:$Z$300,1,FALSE))=TRUE,0,VLOOKUP($D41,'[2]Day 1 data entry'!C$3:X$152,19,FALSE)))","v":18},0,6,{"$f":"IF($B41=\"\",\"\",IF(ISNA(VLOOKUP($C41,'[2]Day 1 (All)'!$Y$3:$Z$300,1,FALSE))=TRUE,0,VLOOKUP($D41,'[2]Day 1 data entry'!C$3:X$152,22,FALSE)))","v":"DAB"},{"$f":"IF(ISERROR(SMALL('[2]Day 1 (All)'!O$3:O$152,A41))=TRUE,\"\",(SMALL('[2]Day 1 (All)'!O$3:O$152,A41)))","v":31}]
[39,{"$f":"IF(I42=\"\",\"\",IF(ISNA(VLOOKUP($D42,'[2]Teams & Anglers'!$B$7:$F$156,1,FALSE))=TRUE,\"\",VLOOKUP($D42,'[2]Teams & Anglers'!$B$7:$F$1566,4,FALSE)))","v":"PERRY, Joe"},{"$f":"IF(ISNA(VLOOKUP($D42,'[2]Teams & Anglers'!$B$7:$F$156,1,FALSE))=TRUE,\"\",VLOOKUP($D42,'[2]Teams & Anglers'!$B$7:$F$1566,3,FALSE))","v":87},{"$f":"IF(I42=\"\",\"\",INDEX('[2]Day 1 (All)'!$AA$3:$AA$152,SMALL(IF('[2]Day 1 (All)'!$O$3:$O$152=$I42,ROW('[2]Day 1 (All)'!$O$3:$O$152)-ROW(I$4)+2),COUNTIF($I$4:$I42,$I42))))","v":108},{"$f":"IF($B42=\"\",\"\",IF(ISNA(VLOOKUP($C42,'[2]Day 1 (All)'!$Y$3:$Z$300,1,FALSE))=TRUE,0,VLOOKUP($D42,'[2]Day 1 data entry'!C$3:X$152,19,FALSE)))","v":18},0,6,{"$f":"IF($B42=\"\",\"\",IF(ISNA(VLOOKUP($C42,'[2]Day 1 (All)'!$Y$3:$Z$300,1,FALSE))=TRUE,0,VLOOKUP($D42,'[2]Day 1 data entry'!C$3:X$152,22,FALSE)))","v":"DAB"},{"$f":"IF(ISERROR(SMALL('[2]Day 1 (All)'!O$3:O$152,A42))=TRUE,\"\",(SMALL('[2]Day 1 (All)'!O$3:O$152,A42)))","v":31}]
[40,{"$f":"IF(I43=\"\",\"\",IF(ISNA(VLOOKUP($D43,'[2]Teams & Anglers'!$B$7:$F$156,1,FALSE))=TRUE,\"\",VLOOKUP($D43,'[2]Teams & Anglers'!$B$7:$F$1566,4,FALSE)))","v":"MOORING, Luke"},{"$f":"IF(ISNA(VLOOKUP($D43,'[2]Teams & Anglers'!$B$7:$F$156,1,FALSE))=TRUE,\"\",VLOOKUP($D43,'[2]Teams & Anglers'!$B$7:$F$1566,3,FALSE))","v":76},{"$f":"IF(I43=\"\",\"\",INDEX('[2]Day 1 (All)'!$AA$3:$AA$152,SMALL(IF('[2]Day 1 (All)'!$O$3:$O$152=$I43,ROW('[2]Day 1 (All)'!$O$3:$O$152)-ROW(I$4)+2),COUNTIF($I$4:$I43,$I43))))","v":111},{"$f":"IF($B43=\"\",\"\",IF(ISNA(VLOOKUP($C43,'[2]Day 1 (All)'!$Y$3:$Z$300,1,FALSE))=TRUE,0,VLOOKUP($D43,'[2]Day 1 data entry'!C$3:X$152,19,FALSE)))","v":18},0,6,{"$f":"IF($B43=\"\",\"\",IF(ISNA(VLOOKUP($C43,'[2]Day 1 (All)'!$Y$3:$Z$300,1,FALSE))=TRUE,0,VLOOKUP($D43,'[2]Day 1 data entry'!C$3:X$152,22,FALSE)))","v":"DAB"},{"$f":"IF(ISERROR(SMALL('[2]Day 1 (All)'!O$3:O$152,A43))=TRUE,\"\",(SMALL('[2]Day 1 (All)'!O$3:O$152,A43)))","v":31}]
[41,{"$f":"IF(I44=\"\",\"\",IF(ISNA(VLOOKUP($D44,'[2]Teams & Anglers'!$B$7:$F$156,1,FALSE))=TRUE,\"\",VLOOKUP($D44,'[2]Teams & Anglers'!$B$7:$F$1566,4,FALSE)))","v":"HIGHFIELD, Nik"},{"$f":"IF(ISNA(VLOOKUP($D44,'[2]Teams & Anglers'!$B$7:$F$156,1,FALSE))=TRUE,\"\",VLOOKUP($D44,'[2]Teams & Anglers'!$B$7:$F$1566,3,FALSE))","v":55},{"$f":"IF(I44=\"\",\"\",INDEX('[2]Day 1 (All)'!$AA$3:$AA$152,SMALL(IF('[2]Day 1 (All)'!$O$3:$O$152=$I44,ROW('[2]Day 1 (All)'!$O$3:$O$152)-ROW(I$4)+2),COUNTIF($I$4:$I44,$I44))))","v":9},{"$f":"IF($B44=\"\",\"\",IF(ISNA(VLOOKUP($C44,'[2]Day 1 (All)'!$Y$3:$Z$300,1,FALSE))=TRUE,0,VLOOKUP($D44,'[2]Day 1 data entry'!C$3:X$152,19,FALSE)))","v":16},0,5.333333333333333,{"$f":"IF($B44=\"\",\"\",IF(ISNA(VLOOKUP($C44,'[2]Day 1 (All)'!$Y$3:$Z$300,1,FALSE))=TRUE,0,VLOOKUP($D44,'[2]Day 1 data entry'!C$3:X$152,22,FALSE)))","v":"DAB"},{"$f":"IF(ISERROR(SMALL('[2]Day 1 (All)'!O$3:O$152,A44))=TRUE,\"\",(SMALL('[2]Day 1 (All)'!O$3:O$152,A44)))","v":41}]
[42,{"$f":"IF(I45=\"\",\"\",IF(ISNA(VLOOKUP($D45,'[2]Teams & Anglers'!$B$7:$F$156,1,FALSE))=TRUE,\"\",VLOOKUP($D45,'[2]Teams & Anglers'!$B$7:$F$1566,4,FALSE)))","v":"LAY-FLURRIE, Matt"},{"$f":"IF(ISNA(VLOOKUP($D45,'[2]Teams & Anglers'!$B$7:$F$156,1,FALSE))=TRUE,\"\",VLOOKUP($D45,'[2]Teams & Anglers'!$B$7:$F$1566,3,FALSE))","v":66},{"$f":"IF(I45=\"\",\"\",INDEX('[2]Day 1 (All)'!$AA$3:$AA$152,SMALL(IF('[2]Day 1 (All)'!$O$3:$O$152=$I45,ROW('[2]Day 1 (All)'!$O$3:$O$152)-ROW(I$4)+2),COUNTIF($I$4:$I45,$I45))))","v":12},{"$f":"IF($B45=\"\",\"\",IF(ISNA(VLOOKUP($C45,'[2]Day 1 (All)'!$Y$3:$Z$300,1,FALSE))=TRUE,0,VLOOKUP($D45,'[2]Day 1 data entry'!C$3:X$152,19,FALSE)))","v":16},0,5.333333333333333,{"$f":"IF($B45=\"\",\"\",IF(ISNA(VLOOKUP($C45,'[2]Day 1 (All)'!$Y$3:$Z$300,1,FALSE))=TRUE,0,VLOOKUP($D45,'[2]Day 1 data entry'!C$3:X$152,22,FALSE)))","v":"DAB"},{"$f":"IF(ISERROR(SMALL('[2]Day 1 (All)'!O$3:O$152,A45))=TRUE,\"\",(SMALL('[2]Day 1 (All)'!O$3:O$152,A45)))","v":41}]
[43,{"$f":"IF(I46=\"\",\"\",IF(ISNA(VLOOKUP($D46,'[2]Teams & Anglers'!$B$7:$F$156,1,FALSE))=TRUE,\"\",VLOOKUP($D46,'[2]Teams & Anglers'!$B$7:$F$1566,4,FALSE)))","v":"BOWELL, Ian"},{"$f":"IF(ISNA(VLOOKUP($D46,'[2]Teams & Anglers'!$B$7:$F$156,1,FALSE))=TRUE,\"\",VLOOKUP($D46,'[2]Teams & Anglers'!$B$7:$F$1566,3,FALSE))","v":16},{"$f":"IF(I46=\"\",\"\",INDEX('[2]Day 1 (All)'!$AA$3:$AA$152,SMALL(IF('[2]Day 1 (All)'!$O$3:$O$152=$I46,ROW('[2]Day 1 (All)'!$O$3:$O$152)-ROW(I$4)+2),COUNTIF($I$4:$I46,$I46))))","v":15},{"$f":"IF($B46=\"\",\"\",IF(ISNA(VLOOKUP($C46,'[2]Day 1 (All)'!$Y$3:$Z$300,1,FALSE))=TRUE,0,VLOOKUP($D46,'[2]Day 1 data entry'!C$3:X$152,19,FALSE)))","v":16},0,5.333333333333333,{"$f":"IF($B46=\"\",\"\",IF(ISNA(VLOOKUP($C46,'[2]Day 1 (All)'!$Y$3:$Z$300,1,FALSE))=TRUE,0,VLOOKUP($D46,'[2]Day 1 data entry'!C$3:X$152,22,FALSE)))","v":"DAB"},{"$f":"IF(ISERROR(SMALL('[2]Day 1 (All)'!O$3:O$152,A46))=TRUE,\"\",(SMALL('[2]Day 1 (All)'!O$3:O$152,A46)))","v":41}]
[44,{"$f":"IF(I47=\"\",\"\",IF(ISNA(VLOOKUP($D47,'[2]Teams & Anglers'!$B$7:$F$156,1,FALSE))=TRUE,\"\",VLOOKUP($D47,'[2]Teams & Anglers'!$B$7:$F$1566,4,FALSE)))","v":"TUCK, Rob"},{"$f":"IF(ISNA(VLOOKUP($D47,'[2]Teams & Anglers'!$B$7:$F$156,1,FALSE))=TRUE,\"\",VLOOKUP($D47,'[2]Teams & Anglers'!$B$7:$F$1566,3,FALSE))","v":116},{"$f":"IF(I47=\"\",\"\",INDEX('[2]Day 1 (All)'!$AA$3:$AA$152,SMALL(IF('[2]Day 1 (All)'!$O$3:$O$152=$I47,ROW('[2]Day 1 (All)'!$O$3:$O$152)-ROW(I$4)+2),COUNTIF($I$4:$I47,$I47))))","v":42},{"$f":"IF($B47=\"\",\"\",IF(ISNA(VLOOKUP($C47,'[2]Day 1 (All)'!$Y$3:$Z$300,1,FALSE))=TRUE,0,VLOOKUP($D47,'[2]Day 1 data entry'!C$3:X$152,19,FALSE)))","v":16},0,5.333333333333333,{"$f":"IF($B47=\"\",\"\",IF(ISNA(VLOOKUP($C47,'[2]Day 1 (All)'!$Y$3:$Z$300,1,FALSE))=TRUE,0,VLOOKUP($D47,'[2]Day 1 data entry'!C$3:X$152,22,FALSE)))","v":"DAB"},{"$f":"IF(ISERROR(SMALL('[2]Day 1 (All)'!O$3:O$152,A47))=TRUE,\"\",(SMALL('[2]Day 1 (All)'!O$3:O$152,A47)))","v":41}]
[45,{"$f":"IF(I48=\"\",\"\",IF(ISNA(VLOOKUP($D48,'[2]Teams & Anglers'!$B$7:$F$156,1,FALSE))=TRUE,\"\",VLOOKUP($D48,'[2]Teams & Anglers'!$B$7:$F$1566,4,FALSE)))","v":"BUY, Craig"},{"$f":"IF(ISNA(VLOOKUP($D48,'[2]Teams & Anglers'!$B$7:$F$156,1,FALSE))=TRUE,\"\",VLOOKUP($D48,'[2]Teams & Anglers'!$B$7:$F$1566,3,FALSE))","v":21},{"$f":"IF(I48=\"\",\"\",INDEX('[2]Day 1 (All)'!$AA$3:$AA$152,SMALL(IF('[2]Day 1 (All)'!$O$3:$O$152=$I48,ROW('[2]Day 1 (All)'!$O$3:$O$152)-ROW(I$4)+2),COUNTIF($I$4:$I48,$I48))))","v":49},{"$f":"IF($B48=\"\",\"\",IF(ISNA(VLOOKUP($C48,'[2]Day 1 (All)'!$Y$3:$Z$300,1,FALSE))=TRUE,0,VLOOKUP($D48,'[2]Day 1 data entry'!C$3:X$152,19,FALSE)))","v":16},0,5.333333333333333,{"$f":"IF($B48=\"\",\"\",IF(ISNA(VLOOKUP($C48,'[2]Day 1 (All)'!$Y$3:$Z$300,1,FALSE))=TRUE,0,VLOOKUP($D48,'[2]Day 1 data entry'!C$3:X$152,22,FALSE)))","v":"DAB"},{"$f":"IF(ISERROR(SMALL('[2]Day 1 (All)'!O$3:O$152,A48))=TRUE,\"\",(SMALL('[2]Day 1 (All)'!O$3:O$152,A48)))","v":41}]
[46,{"$f":"IF(I49=\"\",\"\",IF(ISNA(VLOOKUP($D49,'[2]Teams & Anglers'!$B$7:$F$156,1,FALSE))=TRUE,\"\",VLOOKUP($D49,'[2]Teams & Anglers'!$B$7:$F$1566,4,FALSE)))","v":"THORNTON, Lee"},{"$f":"IF(ISNA(VLOOKUP($D49,'[2]Teams & Anglers'!$B$7:$F$156,1,FALSE))=TRUE,\"\",VLOOKUP($D49,'[2]Teams & Anglers'!$B$7:$F$1566,3,FALSE))","v":112},{"$f":"IF(I49=\"\",\"\",INDEX('[2]Day 1 (All)'!$AA$3:$AA$152,SMALL(IF('[2]Day 1 (All)'!$O$3:$O$152=$I49,ROW('[2]Day 1 (All)'!$O$3:$O$152)-ROW(I$4)+2),COUNTIF($I$4:$I49,$I49))))","v":56},{"$f":"IF($B49=\"\",\"\",IF(ISNA(VLOOKUP($C49,'[2]Day 1 (All)'!$Y$3:$Z$300,1,FALSE))=TRUE,0,VLOOKUP($D49,'[2]Day 1 data entry'!C$3:X$152,19,FALSE)))","v":16},0,5.333333333333333,{"$f":"IF($B49=\"\",\"\",IF(ISNA(VLOOKUP($C49,'[2]Day 1 (All)'!$Y$3:$Z$300,1,FALSE))=TRUE,0,VLOOKUP($D49,'[2]Day 1 data entry'!C$3:X$152,22,FALSE)))","v":"FLOUNDER"},{"$f":"IF(ISERROR(SMALL('[2]Day 1 (All)'!O$3:O$152,A49))=TRUE,\"\",(SMALL('[2]Day 1 (All)'!O$3:O$152,A49)))","v":41}]
[47,{"$f":"IF(I50=\"\",\"\",IF(ISNA(VLOOKUP($D50,'[2]Teams & Anglers'!$B$7:$F$156,1,FALSE))=TRUE,\"\",VLOOKUP($D50,'[2]Teams & Anglers'!$B$7:$F$1566,4,FALSE)))","v":"HARRISON, Paul"},{"$f":"IF(ISNA(VLOOKUP($D50,'[2]Teams & Anglers'!$B$7:$F$156,1,FALSE))=TRUE,\"\",VLOOKUP($D50,'[2]Teams & Anglers'!$B$7:$F$1566,3,FALSE))","v":51},{"$f":"IF(I50=\"\",\"\",INDEX('[2]Day 1 (All)'!$AA$3:$AA$152,SMALL(IF('[2]Day 1 (All)'!$O$3:$O$152=$I50,ROW('[2]Day 1 (All)'!$O$3:$O$152)-ROW(I$4)+2),COUNTIF($I$4:$I50,$I50))))","v":78},{"$f":"IF($B50=\"\",\"\",IF(ISNA(VLOOKUP($C50,'[2]Day 1 (All)'!$Y$3:$Z$300,1,FALSE))=TRUE,0,VLOOKUP($D50,'[2]Day 1 data entry'!C$3:X$152,19,FALSE)))","v":16},0,5.333333333333333,{"$f":"IF($B50=\"\",\"\",IF(ISNA(VLOOKUP($C50,'[2]Day 1 (All)'!$Y$3:$Z$300,1,FALSE))=TRUE,0,VLOOKUP($D50,'[2]Day 1 data entry'!C$3:X$152,22,FALSE)))","v":"DAB"},{"$f":"IF(ISERROR(SMALL('[2]Day 1 (All)'!O$3:O$152,A50))=TRUE,\"\",(SMALL('[2]Day 1 (All)'!O$3:O$152,A50)))","v":41}]
[48,{"$f":"IF(I51=\"\",\"\",IF(ISNA(VLOOKUP($D51,'[2]Teams & Anglers'!$B$7:$F$156,1,FALSE))=TRUE,\"\",VLOOKUP($D51,'[2]Teams & Anglers'!$B$7:$F$1566,4,FALSE)))","v":"SELF, Bevan"},{"$f":"IF(ISNA(VLOOKUP($D51,'[2]Teams & Anglers'!$B$7:$F$156,1,FALSE))=TRUE,\"\",VLOOKUP($D51,'[2]Teams & Anglers'!$B$7:$F$1566,3,FALSE))","v":100},{"$f":"IF(I51=\"\",\"\",INDEX('[2]Day 1 (All)'!$AA$3:$AA$152,SMALL(IF('[2]Day 1 (All)'!$O$3:$O$152=$I51,ROW('[2]Day 1 (All)'!$O$3:$O$152)-ROW(I$4)+2),COUNTIF($I$4:$I51,$I51))))","v":100},{"$f":"IF($B51=\"\",\"\",IF(ISNA(VLOOKUP($C51,'[2]Day 1 (All)'!$Y$3:$Z$300,1,FALSE))=TRUE,0,VLOOKUP($D51,'[2]Day 1 data entry'!C$3:X$152,19,FALSE)))","v":16},0,5.333333333333333,{"$f":"IF($B51=\"\",\"\",IF(ISNA(VLOOKUP($C51,'[2]Day 1 (All)'!$Y$3:$Z$300,1,FALSE))=TRUE,0,VLOOKUP($D51,'[2]Day 1 data entry'!C$3:X$152,22,FALSE)))","v":"DAB"},{"$f":"IF(ISERROR(SMALL('[2]Day 1 (All)'!O$3:O$152,A51))=TRUE,\"\",(SMALL('[2]Day 1 (All)'!O$3:O$152,A51)))","v":41}]
[49,{"$f":"IF(I52=\"\",\"\",IF(ISNA(VLOOKUP($D52,'[2]Teams & Anglers'!$B$7:$F$156,1,FALSE))=TRUE,\"\",VLOOKUP($D52,'[2]Teams & Anglers'!$B$7:$F$1566,4,FALSE)))","v":"NICHOLSON, Steven"},{"$f":"IF(ISNA(VLOOKUP($D52,'[2]Teams & Anglers'!$B$7:$F$156,1,FALSE))=TRUE,\"\",VLOOKUP($D52,'[2]Teams & Anglers'!$B$7:$F$1566,3,FALSE))","v":80},{"$f":"IF(I52=\"\",\"\",INDEX('[2]Day 1 (All)'!$AA$3:$AA$152,SMALL(IF('[2]Day 1 (All)'!$O$3:$O$152=$I52,ROW('[2]Day 1 (All)'!$O$3:$O$152)-ROW(I$4)+2),COUNTIF($I$4:$I52,$I52))))","v":104},{"$f":"IF($B52=\"\",\"\",IF(ISNA(VLOOKUP($C52,'[2]Day 1 (All)'!$Y$3:$Z$300,1,FALSE))=TRUE,0,VLOOKUP($D52,'[2]Day 1 data entry'!C$3:X$152,19,FALSE)))","v":16},0,5.333333333333333,{"$f":"IF($B52=\"\",\"\",IF(ISNA(VLOOKUP($C52,'[2]Day 1 (All)'!$Y$3:$Z$300,1,FALSE))=TRUE,0,VLOOKUP($D52,'[2]Day 1 data entry'!C$3:X$152,22,FALSE)))","v":"DAB"},{"$f":"IF(ISERROR(SMALL('[2]Day 1 (All)'!O$3:O$152,A52))=TRUE,\"\",(SMALL('[2]Day 1 (All)'!O$3:O$152,A52)))","v":41}]
[50,{"$f":"IF(I53=\"\",\"\",IF(ISNA(VLOOKUP($D53,'[2]Teams & Anglers'!$B$7:$F$156,1,FALSE))=TRUE,\"\",VLOOKUP($D53,'[2]Teams & Anglers'!$B$7:$F$1566,4,FALSE)))","v":"ROPER, Liam"},{"$f":"IF(ISNA(VLOOKUP($D53,'[2]Teams & Anglers'!$B$7:$F$156,1,FALSE))=TRUE,\"\",VLOOKUP($D53,'[2]Teams & Anglers'!$B$7:$F$1566,3,FALSE))","v":96},{"$f":"IF(I53=\"\",\"\",INDEX('[2]Day 1 (All)'!$AA$3:$AA$152,SMALL(IF('[2]Day 1 (All)'!$O$3:$O$152=$I53,ROW('[2]Day 1 (All)'!$O$3:$O$152)-ROW(I$4)+2),COUNTIF($I$4:$I53,$I53))))","v":107},{"$f":"IF($B53=\"\",\"\",IF(ISNA(VLOOKUP($C53,'[2]Day 1 (All)'!$Y$3:$Z$300,1,FALSE))=TRUE,0,VLOOKUP($D53,'[2]Day 1 data entry'!C$3:X$152,19,FALSE)))","v":16},0,5.333333333333333,{"$f":"IF($B53=\"\",\"\",IF(ISNA(VLOOKUP($C53,'[2]Day 1 (All)'!$Y$3:$Z$300,1,FALSE))=TRUE,0,VLOOKUP($D53,'[2]Day 1 data entry'!C$3:X$152,22,FALSE)))","v":"DAB"},{"$f":"IF(ISERROR(SMALL('[2]Day 1 (All)'!O$3:O$152,A53))=TRUE,\"\",(SMALL('[2]Day 1 (All)'!O$3:O$152,A53)))","v":41}]
[51,{"$f":"IF(I54=\"\",\"\",IF(ISNA(VLOOKUP($D54,'[2]Teams & Anglers'!$B$7:$F$156,1,FALSE))=TRUE,\"\",VLOOKUP($D54,'[2]Teams & Anglers'!$B$7:$F$1566,4,FALSE)))","v":"PEMBERTON, Andy"},{"$f":"IF(ISNA(VLOOKUP($D54,'[2]Teams & Anglers'!$B$7:$F$156,1,FALSE))=TRUE,\"\",VLOOKUP($D54,'[2]Teams & Anglers'!$B$7:$F$1566,3,FALSE))","v":86},{"$f":"IF(I54=\"\",\"\",INDEX('[2]Day 1 (All)'!$AA$3:$AA$152,SMALL(IF('[2]Day 1 (All)'!$O$3:$O$152=$I54,ROW('[2]Day 1 (All)'!$O$3:$O$152)-ROW(I$4)+2),COUNTIF($I$4:$I54,$I54))))","v":117},{"$f":"IF($B54=\"\",\"\",IF(ISNA(VLOOKUP($C54,'[2]Day 1 (All)'!$Y$3:$Z$300,1,FALSE))=TRUE,0,VLOOKUP($D54,'[2]Day 1 data entry'!C$3:X$152,19,FALSE)))","v":16},0,5.333333333333333,{"$f":"IF($B54=\"\",\"\",IF(ISNA(VLOOKUP($C54,'[2]Day 1 (All)'!$Y$3:$Z$300,1,FALSE))=TRUE,0,VLOOKUP($D54,'[2]Day 1 data entry'!C$3:X$152,22,FALSE)))","v":"DAB"},{"$f":"IF(ISERROR(SMALL('[2]Day 1 (All)'!O$3:O$152,A54))=TRUE,\"\",(SMALL('[2]Day 1 (All)'!O$3:O$152,A54)))","v":41}]
[52,{"$f":"IF(I55=\"\",\"\",IF(ISNA(VLOOKUP($D55,'[2]Teams & Anglers'!$B$7:$F$156,1,FALSE))=TRUE,\"\",VLOOKUP($D55,'[2]Teams & Anglers'!$B$7:$F$1566,4,FALSE)))","v":"SPALL, Chris"},{"$f":"IF(ISNA(VLOOKUP($D55,'[2]Teams & Anglers'!$B$7:$F$156,1,FALSE))=TRUE,\"\",VLOOKUP($D55,'[2]Teams & Anglers'!$B$7:$F$1566,3,FALSE))","v":107},{"$f":"IF(I55=\"\",\"\",INDEX('[2]Day 1 (All)'!$AA$3:$AA$152,SMALL(IF('[2]Day 1 (All)'!$O$3:$O$152=$I55,ROW('[2]Day 1 (All)'!$O$3:$O$152)-ROW(I$4)+2),COUNTIF($I$4:$I55,$I55))))","v":125},{"$f":"IF($B55=\"\",\"\",IF(ISNA(VLOOKUP($C55,'[2]Day 1 (All)'!$Y$3:$Z$300,1,FALSE))=TRUE,0,VLOOKUP($D55,'[2]Day 1 data entry'!C$3:X$152,19,FALSE)))","v":16},0,5.333333333333333,{"$f":"IF($B55=\"\",\"\",IF(ISNA(VLOOKUP($C55,'[2]Day 1 (All)'!$Y$3:$Z$300,1,FALSE))=TRUE,0,VLOOKUP($D55,'[2]Day 1 data entry'!C$3:X$152,22,FALSE)))","v":"DAB"},{"$f":"IF(ISERROR(SMALL('[2]Day 1 (All)'!O$3:O$152,A55))=TRUE,\"\",(SMALL('[2]Day 1 (All)'!O$3:O$152,A55)))","v":41}]
[53,{"$f":"IF(I56=\"\",\"\",IF(ISNA(VLOOKUP($D56,'[2]Teams & Anglers'!$B$7:$F$156,1,FALSE))=TRUE,\"\",VLOOKUP($D56,'[2]Teams & Anglers'!$B$7:$F$1566,4,FALSE)))","v":"ARCH, Joe"},{"$f":"IF(ISNA(VLOOKUP($D56,'[2]Teams & Anglers'!$B$7:$F$156,1,FALSE))=TRUE,\"\",VLOOKUP($D56,'[2]Teams & Anglers'!$B$7:$F$1566,3,FALSE))","v":6},{"$f":"IF(I56=\"\",\"\",INDEX('[2]Day 1 (All)'!$AA$3:$AA$152,SMALL(IF('[2]Day 1 (All)'!$O$3:$O$152=$I56,ROW('[2]Day 1 (All)'!$O$3:$O$152)-ROW(I$4)+2),COUNTIF($I$4:$I56,$I56))))","v":39},{"$f":"IF($B56=\"\",\"\",IF(ISNA(VLOOKUP($C56,'[2]Day 1 (All)'!$Y$3:$Z$300,1,FALSE))=TRUE,0,VLOOKUP($D56,'[2]Day 1 data entry'!C$3:X$152,19,FALSE)))","v":14},0,4.666666666666667,{"$f":"IF($B56=\"\",\"\",IF(ISNA(VLOOKUP($C56,'[2]Day 1 (All)'!$Y$3:$Z$300,1,FALSE))=TRUE,0,VLOOKUP($D56,'[2]Day 1 data entry'!C$3:X$152,22,FALSE)))","v":"DAB"},{"$f":"IF(ISERROR(SMALL('[2]Day 1 (All)'!O$3:O$152,A56))=TRUE,\"\",(SMALL('[2]Day 1 (All)'!O$3:O$152,A56)))","v":53}]
[54,{"$f":"IF(I57=\"\",\"\",IF(ISNA(VLOOKUP($D57,'[2]Teams & Anglers'!$B$7:$F$156,1,FALSE))=TRUE,\"\",VLOOKUP($D57,'[2]Teams & Anglers'!$B$7:$F$1566,4,FALSE)))","v":"ELLIOTT, Nathan"},{"$f":"IF(ISNA(VLOOKUP($D57,'[2]Teams & Anglers'!$B$7:$F$156,1,FALSE))=TRUE,\"\",VLOOKUP($D57,'[2]Teams & Anglers'!$B$7:$F$1566,3,FALSE))","v":38},{"$f":"IF(I57=\"\",\"\",INDEX('[2]Day 1 (All)'!$AA$3:$AA$152,SMALL(IF('[2]Day 1 (All)'!$O$3:$O$152=$I57,ROW('[2]Day 1 (All)'!$O$3:$O$152)-ROW(I$4)+2),COUNTIF($I$4:$I57,$I57))))","v":65},{"$f":"IF($B57=\"\",\"\",IF(ISNA(VLOOKUP($C57,'[2]Day 1 (All)'!$Y$3:$Z$300,1,FALSE))=TRUE,0,VLOOKUP($D57,'[2]Day 1 data entry'!C$3:X$152,19,FALSE)))","v":14},0,4.666666666666667,{"$f":"IF($B57=\"\",\"\",IF(ISNA(VLOOKUP($C57,'[2]Day 1 (All)'!$Y$3:$Z$300,1,FALSE))=TRUE,0,VLOOKUP($D57,'[2]Day 1 data entry'!C$3:X$152,22,FALSE)))","v":"DAB"},{"$f":"IF(ISERROR(SMALL('[2]Day 1 (All)'!O$3:O$152,A57))=TRUE,\"\",(SMALL('[2]Day 1 (All)'!O$3:O$152,A57)))","v":53}]
[55,{"$f":"IF(I58=\"\",\"\",IF(ISNA(VLOOKUP($D58,'[2]Teams & Anglers'!$B$7:$F$156,1,FALSE))=TRUE,\"\",VLOOKUP($D58,'[2]Teams & Anglers'!$B$7:$F$1566,4,FALSE)))","v":"KINGDON, Adam"},{"$f":"IF(ISNA(VLOOKUP($D58,'[2]Teams & Anglers'!$B$7:$F$156,1,FALSE))=TRUE,\"\",VLOOKUP($D58,'[2]Teams & Anglers'!$B$7:$F$1566,3,FALSE))","v":63},{"$f":"IF(I58=\"\",\"\",INDEX('[2]Day 1 (All)'!$AA$3:$AA$152,SMALL(IF('[2]Day 1 (All)'!$O$3:$O$152=$I58,ROW('[2]Day 1 (All)'!$O$3:$O$152)-ROW(I$4)+2),COUNTIF($I$4:$I58,$I58))))","v":70},{"$f":"IF($B58=\"\",\"\",IF(ISNA(VLOOKUP($C58,'[2]Day 1 (All)'!$Y$3:$Z$300,1,FALSE))=TRUE,0,VLOOKUP($D58,'[2]Day 1 data entry'!C$3:X$152,19,FALSE)))","v":14},0,4.666666666666667,{"$f":"IF($B58=\"\",\"\",IF(ISNA(VLOOKUP($C58,'[2]Day 1 (All)'!$Y$3:$Z$300,1,FALSE))=TRUE,0,VLOOKUP($D58,'[2]Day 1 data entry'!C$3:X$152,22,FALSE)))","v":"FLOUNDER"},{"$f":"IF(ISERROR(SMALL('[2]Day 1 (All)'!O$3:O$152,A58))=TRUE,\"\",(SMALL('[2]Day 1 (All)'!O$3:O$152,A58)))","v":53}]
[56,{"$f":"IF(I59=\"\",\"\",IF(ISNA(VLOOKUP($D59,'[2]Teams & Anglers'!$B$7:$F$156,1,FALSE))=TRUE,\"\",VLOOKUP($D59,'[2]Teams & Anglers'!$B$7:$F$1566,4,FALSE)))","v":"SHORTHOUSE, Dave"},{"$f":"IF(ISNA(VLOOKUP($D59,'[2]Teams & Anglers'!$B$7:$F$156,1,FALSE))=TRUE,\"\",VLOOKUP($D59,'[2]Teams & Anglers'!$B$7:$F$1566,3,FALSE))","v":102},{"$f":"IF(I59=\"\",\"\",INDEX('[2]Day 1 (All)'!$AA$3:$AA$152,SMALL(IF('[2]Day 1 (All)'!$O$3:$O$152=$I59,ROW('[2]Day 1 (All)'!$O$3:$O$152)-ROW(I$4)+2),COUNTIF($I$4:$I59,$I59))))","v":83},{"$f":"IF($B59=\"\",\"\",IF(ISNA(VLOOKUP($C59,'[2]Day 1 (All)'!$Y$3:$Z$300,1,FALSE))=TRUE,0,VLOOKUP($D59,'[2]Day 1 data entry'!C$3:X$152,19,FALSE)))","v":14},0,4.666666666666667,{"$f":"IF($B59=\"\",\"\",IF(ISNA(VLOOKUP($C59,'[2]Day 1 (All)'!$Y$3:$Z$300,1,FALSE))=TRUE,0,VLOOKUP($D59,'[2]Day 1 data entry'!C$3:X$152,22,FALSE)))","v":"DAB"},{"$f":"IF(ISERROR(SMALL('[2]Day 1 (All)'!O$3:O$152,A59))=TRUE,\"\",(SMALL('[2]Day 1 (All)'!O$3:O$152,A59)))","v":53}]
[57,{"$f":"IF(I60=\"\",\"\",IF(ISNA(VLOOKUP($D60,'[2]Teams & Anglers'!$B$7:$F$156,1,FALSE))=TRUE,\"\",VLOOKUP($D60,'[2]Teams & Anglers'!$B$7:$F$1566,4,FALSE)))","v":"SMITH, Stephen"},{"$f":"IF(ISNA(VLOOKUP($D60,'[2]Teams & Anglers'!$B$7:$F$156,1,FALSE))=TRUE,\"\",VLOOKUP($D60,'[2]Teams & Anglers'!$B$7:$F$1566,3,FALSE))","v":106},{"$f":"IF(I60=\"\",\"\",INDEX('[2]Day 1 (All)'!$AA$3:$AA$152,SMALL(IF('[2]Day 1 (All)'!$O$3:$O$152=$I60,ROW('[2]Day 1 (All)'!$O$3:$O$152)-ROW(I$4)+2),COUNTIF($I$4:$I60,$I60))))","v":88},{"$f":"IF($B60=\"\",\"\",IF(ISNA(VLOOKUP($C60,'[2]Day 1 (All)'!$Y$3:$Z$300,1,FALSE))=TRUE,0,VLOOKUP($D60,'[2]Day 1 data entry'!C$3:X$152,19,FALSE)))","v":14},0,4.666666666666667,{"$f":"IF($B60=\"\",\"\",IF(ISNA(VLOOKUP($C60,'[2]Day 1 (All)'!$Y$3:$Z$300,1,FALSE))=TRUE,0,VLOOKUP($D60,'[2]Day 1 data entry'!C$3:X$152,22,FALSE)))","v":"DAB"},{"$f":"IF(ISERROR(SMALL('[2]Day 1 (All)'!O$3:O$152,A60))=TRUE,\"\",(SMALL('[2]Day 1 (All)'!O$3:O$152,A60)))","v":53}]
[58,{"$f":"IF(I61=\"\",\"\",IF(ISNA(VLOOKUP($D61,'[2]Teams & Anglers'!$B$7:$F$156,1,FALSE))=TRUE,\"\",VLOOKUP($D61,'[2]Teams & Anglers'!$B$7:$F$1566,4,FALSE)))","v":"PARKER, Al"},{"$f":"IF(ISNA(VLOOKUP($D61,'[2]Teams & Anglers'!$B$7:$F$156,1,FALSE))=TRUE,\"\",VLOOKUP($D61,'[2]Teams & Anglers'!$B$7:$F$1566,3,FALSE))","v":82},{"$f":"IF(I61=\"\",\"\",INDEX('[2]Day 1 (All)'!$AA$3:$AA$152,SMALL(IF('[2]Day 1 (All)'!$O$3:$O$152=$I61,ROW('[2]Day 1 (All)'!$O$3:$O$152)-ROW(I$4)+2),COUNTIF($I$4:$I61,$I61))))","v":92},{"$f":"IF($B61=\"\",\"\",IF(ISNA(VLOOKUP($C61,'[2]Day 1 (All)'!$Y$3:$Z$300,1,FALSE))=TRUE,0,VLOOKUP($D61,'[2]Day 1 data entry'!C$3:X$152,19,FALSE)))","v":14},0,4.666666666666667,{"$f":"IF($B61=\"\",\"\",IF(ISNA(VLOOKUP($C61,'[2]Day 1 (All)'!$Y$3:$Z$300,1,FALSE))=TRUE,0,VLOOKUP($D61,'[2]Day 1 data entry'!C$3:X$152,22,FALSE)))","v":"DAB"},{"$f":"IF(ISERROR(SMALL('[2]Day 1 (All)'!O$3:O$152,A61))=TRUE,\"\",(SMALL('[2]Day 1 (All)'!O$3:O$152,A61)))","v":53}]
[59,{"$f":"IF(I62=\"\",\"\",IF(ISNA(VLOOKUP($D62,'[2]Teams & Anglers'!$B$7:$F$156,1,FALSE))=TRUE,\"\",VLOOKUP($D62,'[2]Teams & Anglers'!$B$7:$F$1566,4,FALSE)))","v":"HUTCHINSON, Dave"},{"$f":"IF(ISNA(VLOOKUP($D62,'[2]Teams & Anglers'!$B$7:$F$156,1,FALSE))=TRUE,\"\",VLOOKUP($D62,'[2]Teams & Anglers'!$B$7:$F$1566,3,FALSE))","v":59},{"$f":"IF(I62=\"\",\"\",INDEX('[2]Day 1 (All)'!$AA$3:$AA$152,SMALL(IF('[2]Day 1 (All)'!$O$3:$O$152=$I62,ROW('[2]Day 1 (All)'!$O$3:$O$152)-ROW(I$4)+2),COUNTIF($I$4:$I62,$I62))))","v":102},{"$f":"IF($B62=\"\",\"\",IF(ISNA(VLOOKUP($C62,'[2]Day 1 (All)'!$Y$3:$Z$300,1,FALSE))=TRUE,0,VLOOKUP($D62,'[2]Day 1 data entry'!C$3:X$152,19,FALSE)))","v":14},0,4.666666666666667,{"$f":"IF($B62=\"\",\"\",IF(ISNA(VLOOKUP($C62,'[2]Day 1 (All)'!$Y$3:$Z$300,1,FALSE))=TRUE,0,VLOOKUP($D62,'[2]Day 1 data entry'!C$3:X$152,22,FALSE)))","v":"DAB"},{"$f":"IF(ISERROR(SMALL('[2]Day 1 (All)'!O$3:O$152,A62))=TRUE,\"\",(SMALL('[2]Day 1 (All)'!O$3:O$152,A62)))","v":53}]
[60,{"$f":"IF(I63=\"\",\"\",IF(ISNA(VLOOKUP($D63,'[2]Teams & Anglers'!$B$7:$F$156,1,FALSE))=TRUE,\"\",VLOOKUP($D63,'[2]Teams & Anglers'!$B$7:$F$1566,4,FALSE)))","v":"WRIGHT, Dave"},{"$f":"IF(ISNA(VLOOKUP($D63,'[2]Teams & Anglers'!$B$7:$F$156,1,FALSE))=TRUE,\"\",VLOOKUP($D63,'[2]Teams & Anglers'!$B$7:$F$1566,3,FALSE))","v":123},{"$f":"IF(I63=\"\",\"\",INDEX('[2]Day 1 (All)'!$AA$3:$AA$152,SMALL(IF('[2]Day 1 (All)'!$O$3:$O$152=$I63,ROW('[2]Day 1 (All)'!$O$3:$O$152)-ROW(I$4)+2),COUNTIF($I$4:$I63,$I63))))","v":113},{"$f":"IF($B63=\"\",\"\",IF(ISNA(VLOOKUP($C63,'[2]Day 1 (All)'!$Y$3:$Z$300,1,FALSE))=TRUE,0,VLOOKUP($D63,'[2]Day 1 data entry'!C$3:X$152,19,FALSE)))","v":14},0,4.666666666666667,{"$f":"IF($B63=\"\",\"\",IF(ISNA(VLOOKUP($C63,'[2]Day 1 (All)'!$Y$3:$Z$300,1,FALSE))=TRUE,0,VLOOKUP($D63,'[2]Day 1 data entry'!C$3:X$152,22,FALSE)))","v":"DAB"},{"$f":"IF(ISERROR(SMALL('[2]Day 1 (All)'!O$3:O$152,A63))=TRUE,\"\",(SMALL('[2]Day 1 (All)'!O$3:O$152,A63)))","v":53}]
[61,{"$f":"IF(I64=\"\",\"\",IF(ISNA(VLOOKUP($D64,'[2]Teams & Anglers'!$B$7:$F$156,1,FALSE))=TRUE,\"\",VLOOKUP($D64,'[2]Teams & Anglers'!$B$7:$F$1566,4,FALSE)))","v":"McGILLOWAY, Wayne"},{"$f":"IF(ISNA(VLOOKUP($D64,'[2]Teams & Anglers'!$B$7:$F$156,1,FALSE))=TRUE,\"\",VLOOKUP($D64,'[2]Teams & Anglers'!$B$7:$F$1566,3,FALSE))","v":75},{"$f":"IF(I64=\"\",\"\",INDEX('[2]Day 1 (All)'!$AA$3:$AA$152,SMALL(IF('[2]Day 1 (All)'!$O$3:$O$152=$I64,ROW('[2]Day 1 (All)'!$O$3:$O$152)-ROW(I$4)+2),COUNTIF($I$4:$I64,$I64))))","v":6},{"$f":"IF($B64=\"\",\"\",IF(ISNA(VLOOKUP($C64,'[2]Day 1 (All)'!$Y$3:$Z$300,1,FALSE))=TRUE,0,VLOOKUP($D64,'[2]Day 1 data entry'!C$3:X$152,19,FALSE)))","v":12},0,4,{"$f":"IF($B64=\"\",\"\",IF(ISNA(VLOOKUP($C64,'[2]Day 1 (All)'!$Y$3:$Z$300,1,FALSE))=TRUE,0,VLOOKUP($D64,'[2]Day 1 data entry'!C$3:X$152,22,FALSE)))","v":"FLOUNDER"},{"$f":"IF(ISERROR(SMALL('[2]Day 1 (All)'!O$3:O$152,A64))=TRUE,\"\",(SMALL('[2]Day 1 (All)'!O$3:O$152,A64)))","v":61}]
[62,{"$f":"IF(I65=\"\",\"\",IF(ISNA(VLOOKUP($D65,'[2]Teams & Anglers'!$B$7:$F$156,1,FALSE))=TRUE,\"\",VLOOKUP($D65,'[2]Teams & Anglers'!$B$7:$F$1566,4,FALSE)))","v":"STEBBINGS, Robert"},{"$f":"IF(ISNA(VLOOKUP($D65,'[2]Teams & Anglers'!$B$7:$F$156,1,FALSE))=TRUE,\"\",VLOOKUP($D65,'[2]Teams & Anglers'!$B$7:$F$1566,3,FALSE))","v":108},{"$f":"IF(I65=\"\",\"\",INDEX('[2]Day 1 (All)'!$AA$3:$AA$152,SMALL(IF('[2]Day 1 (All)'!$O$3:$O$152=$I65,ROW('[2]Day 1 (All)'!$O$3:$O$152)-ROW(I$4)+2),COUNTIF($I$4:$I65,$I65))))","v":8},{"$f":"IF($B65=\"\",\"\",IF(ISNA(VLOOKUP($C65,'[2]Day 1 (All)'!$Y$3:$Z$300,1,FALSE))=TRUE,0,VLOOKUP($D65,'[2]Day 1 data entry'!C$3:X$152,19,FALSE)))","v":12},0,4,{"$f":"IF($B65=\"\",\"\",IF(ISNA(VLOOKUP($C65,'[2]Day 1 (All)'!$Y$3:$Z$300,1,FALSE))=TRUE,0,VLOOKUP($D65,'[2]Day 1 data entry'!C$3:X$152,22,FALSE)))","v":"FLOUNDER"},{"$f":"IF(ISERROR(SMALL('[2]Day 1 (All)'!O$3:O$152,A65))=TRUE,\"\",(SMALL('[2]Day 1 (All)'!O$3:O$152,A65)))","v":61}]
[63,{"$f":"IF(I66=\"\",\"\",IF(ISNA(VLOOKUP($D66,'[2]Teams & Anglers'!$B$7:$F$156,1,FALSE))=TRUE,\"\",VLOOKUP($D66,'[2]Teams & Anglers'!$B$7:$F$1566,4,FALSE)))","v":"McCOY, Kenny"},{"$f":"IF(ISNA(VLOOKUP($D66,'[2]Teams & Anglers'!$B$7:$F$156,1,FALSE))=TRUE,\"\",VLOOKUP($D66,'[2]Teams & Anglers'!$B$7:$F$1566,3,FALSE))","v":74},{"$f":"IF(I66=\"\",\"\",INDEX('[2]Day 1 (All)'!$AA$3:$AA$152,SMALL(IF('[2]Day 1 (All)'!$O$3:$O$152=$I66,ROW('[2]Day 1 (All)'!$O$3:$O$152)-ROW(I$4)+2),COUNTIF($I$4:$I66,$I66))))","v":43},{"$f":"IF($B66=\"\",\"\",IF(ISNA(VLOOKUP($C66,'[2]Day 1 (All)'!$Y$3:$Z$300,1,FALSE))=TRUE,0,VLOOKUP($D66,'[2]Day 1 data entry'!C$3:X$152,19,FALSE)))","v":12},0,4,{"$f":"IF($B66=\"\",\"\",IF(ISNA(VLOOKUP($C66,'[2]Day 1 (All)'!$Y$3:$Z$300,1,FALSE))=TRUE,0,VLOOKUP($D66,'[2]Day 1 data entry'!C$3:X$152,22,FALSE)))","v":"DAB"},{"$f":"IF(ISERROR(SMALL('[2]Day 1 (All)'!O$3:O$152,A66))=TRUE,\"\",(SMALL('[2]Day 1 (All)'!O$3:O$152,A66)))","v":61}]
[64,{"$f":"IF(I67=\"\",\"\",IF(ISNA(VLOOKUP($D67,'[2]Teams & Anglers'!$B$7:$F$156,1,FALSE))=TRUE,\"\",VLOOKUP($D67,'[2]Teams & Anglers'!$B$7:$F$1566,4,FALSE)))","v":"MARTLAND, Kev"},{"$f":"IF(ISNA(VLOOKUP($D67,'[2]Teams & Anglers'!$B$7:$F$156,1,FALSE))=TRUE,\"\",VLOOKUP($D67,'[2]Teams & Anglers'!$B$7:$F$1566,3,FALSE))","v":73},{"$f":"IF(I67=\"\",\"\",INDEX('[2]Day 1 (All)'!$AA$3:$AA$152,SMALL(IF('[2]Day 1 (All)'!$O$3:$O$152=$I67,ROW('[2]Day 1 (All)'!$O$3:$O$152)-ROW(I$4)+2),COUNTIF($I$4:$I67,$I67))))","v":75},{"$f":"IF($B67=\"\",\"\",IF(ISNA(VLOOKUP($C67,'[2]Day 1 (All)'!$Y$3:$Z$300,1,FALSE))=TRUE,0,VLOOKUP($D67,'[2]Day 1 data entry'!C$3:X$152,19,FALSE)))","v":12},0,4,{"$f":"IF($B67=\"\",\"\",IF(ISNA(VLOOKUP($C67,'[2]Day 1 (All)'!$Y$3:$Z$300,1,FALSE))=TRUE,0,VLOOKUP($D67,'[2]Day 1 data entry'!C$3:X$152,22,FALSE)))","v":"DAB"},{"$f":"IF(ISERROR(SMALL('[2]Day 1 (All)'!O$3:O$152,A67))=TRUE,\"\",(SMALL('[2]Day 1 (All)'!O$3:O$152,A67)))","v":61}]
[65,{"$f":"IF(I68=\"\",\"\",IF(ISNA(VLOOKUP($D68,'[2]Teams & Anglers'!$B$7:$F$156,1,FALSE))=TRUE,\"\",VLOOKUP($D68,'[2]Teams & Anglers'!$B$7:$F$1566,4,FALSE)))","v":"PRICE, Alan"},{"$f":"IF(ISNA(VLOOKUP($D68,'[2]Teams & Anglers'!$B$7:$F$156,1,FALSE))=TRUE,\"\",VLOOKUP($D68,'[2]Teams & Anglers'!$B$7:$F$1566,3,FALSE))","v":90},{"$f":"IF(I68=\"\",\"\",INDEX('[2]Day 1 (All)'!$AA$3:$AA$152,SMALL(IF('[2]Day 1 (All)'!$O$3:$O$152=$I68,ROW('[2]Day 1 (All)'!$O$3:$O$152)-ROW(I$4)+2),COUNTIF($I$4:$I68,$I68))))","v":77},{"$f":"IF($B68=\"\",\"\",IF(ISNA(VLOOKUP($C68,'[2]Day 1 (All)'!$Y$3:$Z$300,1,FALSE))=TRUE,0,VLOOKUP($D68,'[2]Day 1 data entry'!C$3:X$152,19,FALSE)))","v":12},0,4,{"$f":"IF($B68=\"\",\"\",IF(ISNA(VLOOKUP($C68,'[2]Day 1 (All)'!$Y$3:$Z$300,1,FALSE))=TRUE,0,VLOOKUP($D68,'[2]Day 1 data entry'!C$3:X$152,22,FALSE)))","v":"DAB"},{"$f":"IF(ISERROR(SMALL('[2]Day 1 (All)'!O$3:O$152,A68))=TRUE,\"\",(SMALL('[2]Day 1 (All)'!O$3:O$152,A68)))","v":61}]
[66,{"$f":"IF(I69=\"\",\"\",IF(ISNA(VLOOKUP($D69,'[2]Teams & Anglers'!$B$7:$F$156,1,FALSE))=TRUE,\"\",VLOOKUP($D69,'[2]Teams & Anglers'!$B$7:$F$1566,4,FALSE)))","v":"RYDER, Edde"},{"$f":"IF(ISNA(VLOOKUP($D69,'[2]Teams & Anglers'!$B$7:$F$156,1,FALSE))=TRUE,\"\",VLOOKUP($D69,'[2]Teams & Anglers'!$B$7:$F$1566,3,FALSE))","v":99},{"$f":"IF(I69=\"\",\"\",INDEX('[2]Day 1 (All)'!$AA$3:$AA$152,SMALL(IF('[2]Day 1 (All)'!$O$3:$O$152=$I69,ROW('[2]Day 1 (All)'!$O$3:$O$152)-ROW(I$4)+2),COUNTIF($I$4:$I69,$I69))))","v":87},{"$f":"IF($B69=\"\",\"\",IF(ISNA(VLOOKUP($C69,'[2]Day 1 (All)'!$Y$3:$Z$300,1,FALSE))=TRUE,0,VLOOKUP($D69,'[2]Day 1 data entry'!C$3:X$152,19,FALSE)))","v":12},0,4,{"$f":"IF($B69=\"\",\"\",IF(ISNA(VLOOKUP($C69,'[2]Day 1 (All)'!$Y$3:$Z$300,1,FALSE))=TRUE,0,VLOOKUP($D69,'[2]Day 1 data entry'!C$3:X$152,22,FALSE)))","v":"DAB"},{"$f":"IF(ISERROR(SMALL('[2]Day 1 (All)'!O$3:O$152,A69))=TRUE,\"\",(SMALL('[2]Day 1 (All)'!O$3:O$152,A69)))","v":61}]
[67,{"$f":"IF(I70=\"\",\"\",IF(ISNA(VLOOKUP($D70,'[2]Teams & Anglers'!$B$7:$F$156,1,FALSE))=TRUE,\"\",VLOOKUP($D70,'[2]Teams & Anglers'!$B$7:$F$1566,4,FALSE)))","v":"HAZELGROVE, Gary"},{"$f":"IF(ISNA(VLOOKUP($D70,'[2]Teams & Anglers'!$B$7:$F$156,1,FALSE))=TRUE,\"\",VLOOKUP($D70,'[2]Teams & Anglers'!$B$7:$F$1566,3,FALSE))","v":53},{"$f":"IF(I70=\"\",\"\",INDEX('[2]Day 1 (All)'!$AA$3:$AA$152,SMALL(IF('[2]Day 1 (All)'!$O$3:$O$152=$I70,ROW('[2]Day 1 (All)'!$O$3:$O$152)-ROW(I$4)+2),COUNTIF($I$4:$I70,$I70))))","v":103},{"$f":"IF($B70=\"\",\"\",IF(ISNA(VLOOKUP($C70,'[2]Day 1 (All)'!$Y$3:$Z$300,1,FALSE))=TRUE,0,VLOOKUP($D70,'[2]Day 1 data entry'!C$3:X$152,19,FALSE)))","v":12},0,4,{"$f":"IF($B70=\"\",\"\",IF(ISNA(VLOOKUP($C70,'[2]Day 1 (All)'!$Y$3:$Z$300,1,FALSE))=TRUE,0,VLOOKUP($D70,'[2]Day 1 data entry'!C$3:X$152,22,FALSE)))","v":"DAB"},{"$f":"IF(ISERROR(SMALL('[2]Day 1 (All)'!O$3:O$152,A70))=TRUE,\"\",(SMALL('[2]Day 1 (All)'!O$3:O$152,A70)))","v":61}]
[68,{"$f":"IF(I71=\"\",\"\",IF(ISNA(VLOOKUP($D71,'[2]Teams & Anglers'!$B$7:$F$156,1,FALSE))=TRUE,\"\",VLOOKUP($D71,'[2]Teams & Anglers'!$B$7:$F$1566,4,FALSE)))","v":"BANHAM, Jason"},{"$f":"IF(ISNA(VLOOKUP($D71,'[2]Teams & Anglers'!$B$7:$F$156,1,FALSE))=TRUE,\"\",VLOOKUP($D71,'[2]Teams & Anglers'!$B$7:$F$1566,3,FALSE))","v":10},{"$f":"IF(I71=\"\",\"\",INDEX('[2]Day 1 (All)'!$AA$3:$AA$152,SMALL(IF('[2]Day 1 (All)'!$O$3:$O$152=$I71,ROW('[2]Day 1 (All)'!$O$3:$O$152)-ROW(I$4)+2),COUNTIF($I$4:$I71,$I71))))","v":114},{"$f":"IF($B71=\"\",\"\",IF(ISNA(VLOOKUP($C71,'[2]Day 1 (All)'!$Y$3:$Z$300,1,FALSE))=TRUE,0,VLOOKUP($D71,'[2]Day 1 data entry'!C$3:X$152,19,FALSE)))","v":12},0,4,{"$f":"IF($B71=\"\",\"\",IF(ISNA(VLOOKUP($C71,'[2]Day 1 (All)'!$Y$3:$Z$300,1,FALSE))=TRUE,0,VLOOKUP($D71,'[2]Day 1 data entry'!C$3:X$152,22,FALSE)))","v":"DAB"},{"$f":"IF(ISERROR(SMALL('[2]Day 1 (All)'!O$3:O$152,A71))=TRUE,\"\",(SMALL('[2]Day 1 (All)'!O$3:O$152,A71)))","v":61}]
[69,{"$f":"IF(I72=\"\",\"\",IF(ISNA(VLOOKUP($D72,'[2]Teams & Anglers'!$B$7:$F$156,1,FALSE))=TRUE,\"\",VLOOKUP($D72,'[2]Teams & Anglers'!$B$7:$F$1566,4,FALSE)))","v":"ADAMS, Stephen"},{"$f":"IF(ISNA(VLOOKUP($D72,'[2]Teams & Anglers'!$B$7:$F$156,1,FALSE))=TRUE,\"\",VLOOKUP($D72,'[2]Teams & Anglers'!$B$7:$F$1566,3,FALSE))","v":2},{"$f":"IF(I72=\"\",\"\",INDEX('[2]Day 1 (All)'!$AA$3:$AA$152,SMALL(IF('[2]Day 1 (All)'!$O$3:$O$152=$I72,ROW('[2]Day 1 (All)'!$O$3:$O$152)-ROW(I$4)+2),COUNTIF($I$4:$I72,$I72))))","v":128},{"$f":"IF($B72=\"\",\"\",IF(ISNA(VLOOKUP($C72,'[2]Day 1 (All)'!$Y$3:$Z$300,1,FALSE))=TRUE,0,VLOOKUP($D72,'[2]Day 1 data entry'!C$3:X$152,19,FALSE)))","v":12},0,4,{"$f":"IF($B72=\"\",\"\",IF(ISNA(VLOOKUP($C72,'[2]Day 1 (All)'!$Y$3:$Z$300,1,FALSE))=TRUE,0,VLOOKUP($D72,'[2]Day 1 data entry'!C$3:X$152,22,FALSE)))","v":"DAB"},{"$f":"IF(ISERROR(SMALL('[2]Day 1 (All)'!O$3:O$152,A72))=TRUE,\"\",(SMALL('[2]Day 1 (All)'!O$3:O$152,A72)))","v":61}]
[70,{"$f":"IF(I73=\"\",\"\",IF(ISNA(VLOOKUP($D73,'[2]Teams & Anglers'!$B$7:$F$156,1,FALSE))=TRUE,\"\",VLOOKUP($D73,'[2]Teams & Anglers'!$B$7:$F$1566,4,FALSE)))","v":"BANCROFT, Dave"},{"$f":"IF(ISNA(VLOOKUP($D73,'[2]Teams & Anglers'!$B$7:$F$156,1,FALSE))=TRUE,\"\",VLOOKUP($D73,'[2]Teams & Anglers'!$B$7:$F$1566,3,FALSE))","v":9},{"$f":"IF(I73=\"\",\"\",INDEX('[2]Day 1 (All)'!$AA$3:$AA$152,SMALL(IF('[2]Day 1 (All)'!$O$3:$O$152=$I73,ROW('[2]Day 1 (All)'!$O$3:$O$152)-ROW(I$4)+2),COUNTIF($I$4:$I73,$I73))))","v":23},{"$f":"IF($B73=\"\",\"\",IF(ISNA(VLOOKUP($C73,'[2]Day 1 (All)'!$Y$3:$Z$300,1,FALSE))=TRUE,0,VLOOKUP($D73,'[2]Day 1 data entry'!C$3:X$152,19,FALSE)))","v":10},0,3.3333333333333335,{"$f":"IF($B73=\"\",\"\",IF(ISNA(VLOOKUP($C73,'[2]Day 1 (All)'!$Y$3:$Z$300,1,FALSE))=TRUE,0,VLOOKUP($D73,'[2]Day 1 data entry'!C$3:X$152,22,FALSE)))","v":"DAB"},{"$f":"IF(ISERROR(SMALL('[2]Day 1 (All)'!O$3:O$152,A73))=TRUE,\"\",(SMALL('[2]Day 1 (All)'!O$3:O$152,A73)))","v":70}]
[71,{"$f":"IF(I74=\"\",\"\",IF(ISNA(VLOOKUP($D74,'[2]Teams & Anglers'!$B$7:$F$156,1,FALSE))=TRUE,\"\",VLOOKUP($D74,'[2]Teams & Anglers'!$B$7:$F$1566,4,FALSE)))","v":"LEE, Phil"},{"$f":"IF(ISNA(VLOOKUP($D74,'[2]Teams & Anglers'!$B$7:$F$156,1,FALSE))=TRUE,\"\",VLOOKUP($D74,'[2]Teams & Anglers'!$B$7:$F$1566,3,FALSE))","v":69},{"$f":"IF(I74=\"\",\"\",INDEX('[2]Day 1 (All)'!$AA$3:$AA$152,SMALL(IF('[2]Day 1 (All)'!$O$3:$O$152=$I74,ROW('[2]Day 1 (All)'!$O$3:$O$152)-ROW(I$4)+2),COUNTIF($I$4:$I74,$I74))))","v":33},{"$f":"IF($B74=\"\",\"\",IF(ISNA(VLOOKUP($C74,'[2]Day 1 (All)'!$Y$3:$Z$300,1,FALSE))=TRUE,0,VLOOKUP($D74,'[2]Day 1 data entry'!C$3:X$152,19,FALSE)))","v":10},0,3.3333333333333335,{"$f":"IF($B74=\"\",\"\",IF(ISNA(VLOOKUP($C74,'[2]Day 1 (All)'!$Y$3:$Z$300,1,FALSE))=TRUE,0,VLOOKUP($D74,'[2]Day 1 data entry'!C$3:X$152,22,FALSE)))","v":"DAB"},{"$f":"IF(ISERROR(SMALL('[2]Day 1 (All)'!O$3:O$152,A74))=TRUE,\"\",(SMALL('[2]Day 1 (All)'!O$3:O$152,A74)))","v":70}]
[72,{"$f":"IF(I75=\"\",\"\",IF(ISNA(VLOOKUP($D75,'[2]Teams & Anglers'!$B$7:$F$156,1,FALSE))=TRUE,\"\",VLOOKUP($D75,'[2]Teams & Anglers'!$B$7:$F$1566,4,FALSE)))","v":"RUSSELL, Shane"},{"$f":"IF(ISNA(VLOOKUP($D75,'[2]Teams & Anglers'!$B$7:$F$156,1,FALSE))=TRUE,\"\",VLOOKUP($D75,'[2]Teams & Anglers'!$B$7:$F$1566,3,FALSE))","v":98},{"$f":"IF(I75=\"\",\"\",INDEX('[2]Day 1 (All)'!$AA$3:$AA$152,SMALL(IF('[2]Day 1 (All)'!$O$3:$O$152=$I75,ROW('[2]Day 1 (All)'!$O$3:$O$152)-ROW(I$4)+2),COUNTIF($I$4:$I75,$I75))))","v":72},{"$f":"IF($B75=\"\",\"\",IF(ISNA(VLOOKUP($C75,'[2]Day 1 (All)'!$Y$3:$Z$300,1,FALSE))=TRUE,0,VLOOKUP($D75,'[2]Day 1 data entry'!C$3:X$152,19,FALSE)))","v":10},0,3.3333333333333335,{"$f":"IF($B75=\"\",\"\",IF(ISNA(VLOOKUP($C75,'[2]Day 1 (All)'!$Y$3:$Z$300,1,FALSE))=TRUE,0,VLOOKUP($D75,'[2]Day 1 data entry'!C$3:X$152,22,FALSE)))","v":"DAB"},{"$f":"IF(ISERROR(SMALL('[2]Day 1 (All)'!O$3:O$152,A75))=TRUE,\"\",(SMALL('[2]Day 1 (All)'!O$3:O$152,A75)))","v":70}]
[73,{"$f":"IF(I76=\"\",\"\",IF(ISNA(VLOOKUP($D76,'[2]Teams & Anglers'!$B$7:$F$156,1,FALSE))=TRUE,\"\",VLOOKUP($D76,'[2]Teams & Anglers'!$B$7:$F$1566,4,FALSE)))","v":"PARKER, Daniel"},{"$f":"IF(ISNA(VLOOKUP($D76,'[2]Teams & Anglers'!$B$7:$F$156,1,FALSE))=TRUE,\"\",VLOOKUP($D76,'[2]Teams & Anglers'!$B$7:$F$1566,3,FALSE))","v":83},{"$f":"IF(I76=\"\",\"\",INDEX('[2]Day 1 (All)'!$AA$3:$AA$152,SMALL(IF('[2]Day 1 (All)'!$O$3:$O$152=$I76,ROW('[2]Day 1 (All)'!$O$3:$O$152)-ROW(I$4)+2),COUNTIF($I$4:$I76,$I76))))","v":80},{"$f":"IF($B76=\"\",\"\",IF(ISNA(VLOOKUP($C76,'[2]Day 1 (All)'!$Y$3:$Z$300,1,FALSE))=TRUE,0,VLOOKUP($D76,'[2]Day 1 data entry'!C$3:X$152,19,FALSE)))","v":10},0,3.3333333333333335,{"$f":"IF($B76=\"\",\"\",IF(ISNA(VLOOKUP($C76,'[2]Day 1 (All)'!$Y$3:$Z$300,1,FALSE))=TRUE,0,VLOOKUP($D76,'[2]Day 1 data entry'!C$3:X$152,22,FALSE)))","v":"DAB"},{"$f":"IF(ISERROR(SMALL('[2]Day 1 (All)'!O$3:O$152,A76))=TRUE,\"\",(SMALL('[2]Day 1 (All)'!O$3:O$152,A76)))","v":70}]
[74,{"$f":"IF(I77=\"\",\"\",IF(ISNA(VLOOKUP($D77,'[2]Teams & Anglers'!$B$7:$F$156,1,FALSE))=TRUE,\"\",VLOOKUP($D77,'[2]Teams & Anglers'!$B$7:$F$1566,4,FALSE)))","v":"BORDIANU, Adrian"},{"$f":"IF(ISNA(VLOOKUP($D77,'[2]Teams & Anglers'!$B$7:$F$156,1,FALSE))=TRUE,\"\",VLOOKUP($D77,'[2]Teams & Anglers'!$B$7:$F$1566,3,FALSE))","v":14},{"$f":"IF(I77=\"\",\"\",INDEX('[2]Day 1 (All)'!$AA$3:$AA$152,SMALL(IF('[2]Day 1 (All)'!$O$3:$O$152=$I77,ROW('[2]Day 1 (All)'!$O$3:$O$152)-ROW(I$4)+2),COUNTIF($I$4:$I77,$I77))))","v":91},{"$f":"IF($B77=\"\",\"\",IF(ISNA(VLOOKUP($C77,'[2]Day 1 (All)'!$Y$3:$Z$300,1,FALSE))=TRUE,0,VLOOKUP($D77,'[2]Day 1 data entry'!C$3:X$152,19,FALSE)))","v":10},0,3.3333333333333335,{"$f":"IF($B77=\"\",\"\",IF(ISNA(VLOOKUP($C77,'[2]Day 1 (All)'!$Y$3:$Z$300,1,FALSE))=TRUE,0,VLOOKUP($D77,'[2]Day 1 data entry'!C$3:X$152,22,FALSE)))","v":"DAB"},{"$f":"IF(ISERROR(SMALL('[2]Day 1 (All)'!O$3:O$152,A77))=TRUE,\"\",(SMALL('[2]Day 1 (All)'!O$3:O$152,A77)))","v":70}]
[75,{"$f":"IF(I78=\"\",\"\",IF(ISNA(VLOOKUP($D78,'[2]Teams & Anglers'!$B$7:$F$156,1,FALSE))=TRUE,\"\",VLOOKUP($D78,'[2]Teams & Anglers'!$B$7:$F$1566,4,FALSE)))","v":"BALL, Keith"},{"$f":"IF(ISNA(VLOOKUP($D78,'[2]Teams & Anglers'!$B$7:$F$156,1,FALSE))=TRUE,\"\",VLOOKUP($D78,'[2]Teams & Anglers'!$B$7:$F$1566,3,FALSE))","v":8},{"$f":"IF(I78=\"\",\"\",INDEX('[2]Day 1 (All)'!$AA$3:$AA$152,SMALL(IF('[2]Day 1 (All)'!$O$3:$O$152=$I78,ROW('[2]Day 1 (All)'!$O$3:$O$152)-ROW(I$4)+2),COUNTIF($I$4:$I78,$I78))))","v":97},{"$f":"IF($B78=\"\",\"\",IF(ISNA(VLOOKUP($C78,'[2]Day 1 (All)'!$Y$3:$Z$300,1,FALSE))=TRUE,0,VLOOKUP($D78,'[2]Day 1 data entry'!C$3:X$152,19,FALSE)))","v":10},0,3.3333333333333335,{"$f":"IF($B78=\"\",\"\",IF(ISNA(VLOOKUP($C78,'[2]Day 1 (All)'!$Y$3:$Z$300,1,FALSE))=TRUE,0,VLOOKUP($D78,'[2]Day 1 data entry'!C$3:X$152,22,FALSE)))","v":"DAB"},{"$f":"IF(ISERROR(SMALL('[2]Day 1 (All)'!O$3:O$152,A78))=TRUE,\"\",(SMALL('[2]Day 1 (All)'!O$3:O$152,A78)))","v":70}]
[76,{"$f":"IF(I79=\"\",\"\",IF(ISNA(VLOOKUP($D79,'[2]Teams & Anglers'!$B$7:$F$156,1,FALSE))=TRUE,\"\",VLOOKUP($D79,'[2]Teams & Anglers'!$B$7:$F$1566,4,FALSE)))","v":"PROVINS, Colin"},{"$f":"IF(ISNA(VLOOKUP($D79,'[2]Teams & Anglers'!$B$7:$F$156,1,FALSE))=TRUE,\"\",VLOOKUP($D79,'[2]Teams & Anglers'!$B$7:$F$1566,3,FALSE))","v":93},{"$f":"IF(I79=\"\",\"\",INDEX('[2]Day 1 (All)'!$AA$3:$AA$152,SMALL(IF('[2]Day 1 (All)'!$O$3:$O$152=$I79,ROW('[2]Day 1 (All)'!$O$3:$O$152)-ROW(I$4)+2),COUNTIF($I$4:$I79,$I79))))","v":110},{"$f":"IF($B79=\"\",\"\",IF(ISNA(VLOOKUP($C79,'[2]Day 1 (All)'!$Y$3:$Z$300,1,FALSE))=TRUE,0,VLOOKUP($D79,'[2]Day 1 data entry'!C$3:X$152,19,FALSE)))","v":10},0,3.3333333333333335,{"$f":"IF($B79=\"\",\"\",IF(ISNA(VLOOKUP($C79,'[2]Day 1 (All)'!$Y$3:$Z$300,1,FALSE))=TRUE,0,VLOOKUP($D79,'[2]Day 1 data entry'!C$3:X$152,22,FALSE)))","v":"DAB"},{"$f":"IF(ISERROR(SMALL('[2]Day 1 (All)'!O$3:O$152,A79))=TRUE,\"\",(SMALL('[2]Day 1 (All)'!O$3:O$152,A79)))","v":70}]
[77,{"$f":"IF(I80=\"\",\"\",IF(ISNA(VLOOKUP($D80,'[2]Teams & Anglers'!$B$7:$F$156,1,FALSE))=TRUE,\"\",VLOOKUP($D80,'[2]Teams & Anglers'!$B$7:$F$1566,4,FALSE)))","v":"WELLS, Thomas"},{"$f":"IF(ISNA(VLOOKUP($D80,'[2]Teams & Anglers'!$B$7:$F$156,1,FALSE))=TRUE,\"\",VLOOKUP($D80,'[2]Teams & Anglers'!$B$7:$F$1566,3,FALSE))","v":120},{"$f":"IF(I80=\"\",\"\",INDEX('[2]Day 1 (All)'!$AA$3:$AA$152,SMALL(IF('[2]Day 1 (All)'!$O$3:$O$152=$I80,ROW('[2]Day 1 (All)'!$O$3:$O$152)-ROW(I$4)+2),COUNTIF($I$4:$I80,$I80))))","v":52},{"$f":"IF($B80=\"\",\"\",IF(ISNA(VLOOKUP($C80,'[2]Day 1 (All)'!$Y$3:$Z$300,1,FALSE))=TRUE,0,VLOOKUP($D80,'[2]Day 1 data entry'!C$3:X$152,19,FALSE)))","v":8},0,2.6666666666666665,{"$f":"IF($B80=\"\",\"\",IF(ISNA(VLOOKUP($C80,'[2]Day 1 (All)'!$Y$3:$Z$300,1,FALSE))=TRUE,0,VLOOKUP($D80,'[2]Day 1 data entry'!C$3:X$152,22,FALSE)))","v":"DAB"},{"$f":"IF(ISERROR(SMALL('[2]Day 1 (All)'!O$3:O$152,A80))=TRUE,\"\",(SMALL('[2]Day 1 (All)'!O$3:O$152,A80)))","v":77}]
[78,{"$f":"IF(I81=\"\",\"\",IF(ISNA(VLOOKUP($D81,'[2]Teams & Anglers'!$B$7:$F$156,1,FALSE))=TRUE,\"\",VLOOKUP($D81,'[2]Teams & Anglers'!$B$7:$F$1566,4,FALSE)))","v":"PRICE, Ben"},{"$f":"IF(ISNA(VLOOKUP($D81,'[2]Teams & Anglers'!$B$7:$F$156,1,FALSE))=TRUE,\"\",VLOOKUP($D81,'[2]Teams & Anglers'!$B$7:$F$1566,3,FALSE))","v":91},{"$f":"IF(I81=\"\",\"\",INDEX('[2]Day 1 (All)'!$AA$3:$AA$152,SMALL(IF('[2]Day 1 (All)'!$O$3:$O$152=$I81,ROW('[2]Day 1 (All)'!$O$3:$O$152)-ROW(I$4)+2),COUNTIF($I$4:$I81,$I81))))","v":85},{"$f":"IF($B81=\"\",\"\",IF(ISNA(VLOOKUP($C81,'[2]Day 1 (All)'!$Y$3:$Z$300,1,FALSE))=TRUE,0,VLOOKUP($D81,'[2]Day 1 data entry'!C$3:X$152,19,FALSE)))","v":8},0,2.6666666666666665,{"$f":"IF($B81=\"\",\"\",IF(ISNA(VLOOKUP($C81,'[2]Day 1 (All)'!$Y$3:$Z$300,1,FALSE))=TRUE,0,VLOOKUP($D81,'[2]Day 1 data entry'!C$3:X$152,22,FALSE)))","v":"DAB"},{"$f":"IF(ISERROR(SMALL('[2]Day 1 (All)'!O$3:O$152,A81))=TRUE,\"\",(SMALL('[2]Day 1 (All)'!O$3:O$152,A81)))","v":77}]
[79,{"$f":"IF(I82=\"\",\"\",IF(ISNA(VLOOKUP($D82,'[2]Teams & Anglers'!$B$7:$F$156,1,FALSE))=TRUE,\"\",VLOOKUP($D82,'[2]Teams & Anglers'!$B$7:$F$1566,4,FALSE)))","v":"PARKER, Gavin"},{"$f":"IF(ISNA(VLOOKUP($D82,'[2]Teams & Anglers'!$B$7:$F$156,1,FALSE))=TRUE,\"\",VLOOKUP($D82,'[2]Teams & Anglers'!$B$7:$F$1566,3,FALSE))","v":84},{"$f":"IF(I82=\"\",\"\",INDEX('[2]Day 1 (All)'!$AA$3:$AA$152,SMALL(IF('[2]Day 1 (All)'!$O$3:$O$152=$I82,ROW('[2]Day 1 (All)'!$O$3:$O$152)-ROW(I$4)+2),COUNTIF($I$4:$I82,$I82))))","v":90},{"$f":"IF($B82=\"\",\"\",IF(ISNA(VLOOKUP($C82,'[2]Day 1 (All)'!$Y$3:$Z$300,1,FALSE))=TRUE,0,VLOOKUP($D82,'[2]Day 1 data entry'!C$3:X$152,19,FALSE)))","v":8},0,2.6666666666666665,{"$f":"IF($B82=\"\",\"\",IF(ISNA(VLOOKUP($C82,'[2]Day 1 (All)'!$Y$3:$Z$300,1,FALSE))=TRUE,0,VLOOKUP($D82,'[2]Day 1 data entry'!C$3:X$152,22,FALSE)))","v":"DAB"},{"$f":"IF(ISERROR(SMALL('[2]Day 1 (All)'!O$3:O$152,A82))=TRUE,\"\",(SMALL('[2]Day 1 (All)'!O$3:O$152,A82)))","v":77}]
[80,{"$f":"IF(I83=\"\",\"\",IF(ISNA(VLOOKUP($D83,'[2]Teams & Anglers'!$B$7:$F$156,1,FALSE))=TRUE,\"\",VLOOKUP($D83,'[2]Teams & Anglers'!$B$7:$F$1566,4,FALSE)))","v":"DOY, Alan"},{"$f":"IF(ISNA(VLOOKUP($D83,'[2]Teams & Anglers'!$B$7:$F$156,1,FALSE))=TRUE,\"\",VLOOKUP($D83,'[2]Teams & Anglers'!$B$7:$F$1566,3,FALSE))","v":35},{"$f":"IF(I83=\"\",\"\",INDEX('[2]Day 1 (All)'!$AA$3:$AA$152,SMALL(IF('[2]Day 1 (All)'!$O$3:$O$152=$I83,ROW('[2]Day 1 (All)'!$O$3:$O$152)-ROW(I$4)+2),COUNTIF($I$4:$I83,$I83))))","v":95},{"$f":"IF($B83=\"\",\"\",IF(ISNA(VLOOKUP($C83,'[2]Day 1 (All)'!$Y$3:$Z$300,1,FALSE))=TRUE,0,VLOOKUP($D83,'[2]Day 1 data entry'!C$3:X$152,19,FALSE)))","v":8},0,2.6666666666666665,{"$f":"IF($B83=\"\",\"\",IF(ISNA(VLOOKUP($C83,'[2]Day 1 (All)'!$Y$3:$Z$300,1,FALSE))=TRUE,0,VLOOKUP($D83,'[2]Day 1 data entry'!C$3:X$152,22,FALSE)))","v":"DAB"},{"$f":"IF(ISERROR(SMALL('[2]Day 1 (All)'!O$3:O$152,A83))=TRUE,\"\",(SMALL('[2]Day 1 (All)'!O$3:O$152,A83)))","v":77}]
[81,{"$f":"IF(I84=\"\",\"\",IF(ISNA(VLOOKUP($D84,'[2]Teams & Anglers'!$B$7:$F$156,1,FALSE))=TRUE,\"\",VLOOKUP($D84,'[2]Teams & Anglers'!$B$7:$F$1566,4,FALSE)))","v":"GASCOIGNE, Robert"},{"$f":"IF(ISNA(VLOOKUP($D84,'[2]Teams & Anglers'!$B$7:$F$156,1,FALSE))=TRUE,\"\",VLOOKUP($D84,'[2]Teams & Anglers'!$B$7:$F$1566,3,FALSE))","v":45},{"$f":"IF(I84=\"\",\"\",INDEX('[2]Day 1 (All)'!$AA$3:$AA$152,SMALL(IF('[2]Day 1 (All)'!$O$3:$O$152=$I84,ROW('[2]Day 1 (All)'!$O$3:$O$152)-ROW(I$4)+2),COUNTIF($I$4:$I84,$I84))))","v":98},{"$f":"IF($B84=\"\",\"\",IF(ISNA(VLOOKUP($C84,'[2]Day 1 (All)'!$Y$3:$Z$300,1,FALSE))=TRUE,0,VLOOKUP($D84,'[2]Day 1 data entry'!C$3:X$152,19,FALSE)))","v":8},0,2.6666666666666665,{"$f":"IF($B84=\"\",\"\",IF(ISNA(VLOOKUP($C84,'[2]Day 1 (All)'!$Y$3:$Z$300,1,FALSE))=TRUE,0,VLOOKUP($D84,'[2]Day 1 data entry'!C$3:X$152,22,FALSE)))","v":"DAB"},{"$f":"IF(ISERROR(SMALL('[2]Day 1 (All)'!O$3:O$152,A84))=TRUE,\"\",(SMALL('[2]Day 1 (All)'!O$3:O$152,A84)))","v":77}]
[82,{"$f":"IF(I85=\"\",\"\",IF(ISNA(VLOOKUP($D85,'[2]Teams & Anglers'!$B$7:$F$156,1,FALSE))=TRUE,\"\",VLOOKUP($D85,'[2]Teams & Anglers'!$B$7:$F$1566,4,FALSE)))","v":"KNIGHT, Simon"},{"$f":"IF(ISNA(VLOOKUP($D85,'[2]Teams & Anglers'!$B$7:$F$156,1,FALSE))=TRUE,\"\",VLOOKUP($D85,'[2]Teams & Anglers'!$B$7:$F$1566,3,FALSE))","v":64},{"$f":"IF(I85=\"\",\"\",INDEX('[2]Day 1 (All)'!$AA$3:$AA$152,SMALL(IF('[2]Day 1 (All)'!$O$3:$O$152=$I85,ROW('[2]Day 1 (All)'!$O$3:$O$152)-ROW(I$4)+2),COUNTIF($I$4:$I85,$I85))))","v":121},{"$f":"IF($B85=\"\",\"\",IF(ISNA(VLOOKUP($C85,'[2]Day 1 (All)'!$Y$3:$Z$300,1,FALSE))=TRUE,0,VLOOKUP($D85,'[2]Day 1 data entry'!C$3:X$152,19,FALSE)))","v":8},0,2.6666666666666665,{"$f":"IF($B85=\"\",\"\",IF(ISNA(VLOOKUP($C85,'[2]Day 1 (All)'!$Y$3:$Z$300,1,FALSE))=TRUE,0,VLOOKUP($D85,'[2]Day 1 data entry'!C$3:X$152,22,FALSE)))","v":"DAB"},{"$f":"IF(ISERROR(SMALL('[2]Day 1 (All)'!O$3:O$152,A85))=TRUE,\"\",(SMALL('[2]Day 1 (All)'!O$3:O$152,A85)))","v":77}]
[83,{"$f":"IF(I86=\"\",\"\",IF(ISNA(VLOOKUP($D86,'[2]Teams & Anglers'!$B$7:$F$156,1,FALSE))=TRUE,\"\",VLOOKUP($D86,'[2]Teams & Anglers'!$B$7:$F$1566,4,FALSE)))","v":"THOMAS, Tony"},{"$f":"IF(ISNA(VLOOKUP($D86,'[2]Teams & Anglers'!$B$7:$F$156,1,FALSE))=TRUE,\"\",VLOOKUP($D86,'[2]Teams & Anglers'!$B$7:$F$1566,3,FALSE))","v":111},{"$f":"IF(I86=\"\",\"\",INDEX('[2]Day 1 (All)'!$AA$3:$AA$152,SMALL(IF('[2]Day 1 (All)'!$O$3:$O$152=$I86,ROW('[2]Day 1 (All)'!$O$3:$O$152)-ROW(I$4)+2),COUNTIF($I$4:$I86,$I86))))","v":37},{"$f":"IF($B86=\"\",\"\",IF(ISNA(VLOOKUP($C86,'[2]Day 1 (All)'!$Y$3:$Z$300,1,FALSE))=TRUE,0,VLOOKUP($D86,'[2]Day 1 data entry'!C$3:X$152,19,FALSE)))","v":7},0,2.3333333333333335,{"$f":"IF($B86=\"\",\"\",IF(ISNA(VLOOKUP($C86,'[2]Day 1 (All)'!$Y$3:$Z$300,1,FALSE))=TRUE,0,VLOOKUP($D86,'[2]Day 1 data entry'!C$3:X$152,22,FALSE)))","v":"DAB"},{"$f":"IF(ISERROR(SMALL('[2]Day 1 (All)'!O$3:O$152,A86))=TRUE,\"\",(SMALL('[2]Day 1 (All)'!O$3:O$152,A86)))","v":83}]
[84,{"$f":"IF(I87=\"\",\"\",IF(ISNA(VLOOKUP($D87,'[2]Teams & Anglers'!$B$7:$F$156,1,FALSE))=TRUE,\"\",VLOOKUP($D87,'[2]Teams & Anglers'!$B$7:$F$1566,4,FALSE)))","v":"LINDFIELD, Bill"},{"$f":"IF(ISNA(VLOOKUP($D87,'[2]Teams & Anglers'!$B$7:$F$156,1,FALSE))=TRUE,\"\",VLOOKUP($D87,'[2]Teams & Anglers'!$B$7:$F$1566,3,FALSE))","v":71},{"$f":"IF(I87=\"\",\"\",INDEX('[2]Day 1 (All)'!$AA$3:$AA$152,SMALL(IF('[2]Day 1 (All)'!$O$3:$O$152=$I87,ROW('[2]Day 1 (All)'!$O$3:$O$152)-ROW(I$4)+2),COUNTIF($I$4:$I87,$I87))))","v":59},{"$f":"IF($B87=\"\",\"\",IF(ISNA(VLOOKUP($C87,'[2]Day 1 (All)'!$Y$3:$Z$300,1,FALSE))=TRUE,0,VLOOKUP($D87,'[2]Day 1 data entry'!C$3:X$152,19,FALSE)))","v":7},0,2.3333333333333335,{"$f":"IF($B87=\"\",\"\",IF(ISNA(VLOOKUP($C87,'[2]Day 1 (All)'!$Y$3:$Z$300,1,FALSE))=TRUE,0,VLOOKUP($D87,'[2]Day 1 data entry'!C$3:X$152,22,FALSE)))","v":"DAB"},{"$f":"IF(ISERROR(SMALL('[2]Day 1 (All)'!O$3:O$152,A87))=TRUE,\"\",(SMALL('[2]Day 1 (All)'!O$3:O$152,A87)))","v":83}]
[85,{"$f":"IF(I88=\"\",\"\",IF(ISNA(VLOOKUP($D88,'[2]Teams & Anglers'!$B$7:$F$156,1,FALSE))=TRUE,\"\",VLOOKUP($D88,'[2]Teams & Anglers'!$B$7:$F$1566,4,FALSE)))","v":"BETTINSON, Charles"},{"$f":"IF(ISNA(VLOOKUP($D88,'[2]Teams & Anglers'!$B$7:$F$156,1,FALSE))=TRUE,\"\",VLOOKUP($D88,'[2]Teams & Anglers'!$B$7:$F$1566,3,FALSE))","v":12},{"$f":"IF(I88=\"\",\"\",INDEX('[2]Day 1 (All)'!$AA$3:$AA$152,SMALL(IF('[2]Day 1 (All)'!$O$3:$O$152=$I88,ROW('[2]Day 1 (All)'!$O$3:$O$152)-ROW(I$4)+2),COUNTIF($I$4:$I88,$I88))))","v":64},{"$f":"IF($B88=\"\",\"\",IF(ISNA(VLOOKUP($C88,'[2]Day 1 (All)'!$Y$3:$Z$300,1,FALSE))=TRUE,0,VLOOKUP($D88,'[2]Day 1 data entry'!C$3:X$152,19,FALSE)))","v":7},0,2.3333333333333335,{"$f":"IF($B88=\"\",\"\",IF(ISNA(VLOOKUP($C88,'[2]Day 1 (All)'!$Y$3:$Z$300,1,FALSE))=TRUE,0,VLOOKUP($D88,'[2]Day 1 data entry'!C$3:X$152,22,FALSE)))","v":"DAB"},{"$f":"IF(ISERROR(SMALL('[2]Day 1 (All)'!O$3:O$152,A88))=TRUE,\"\",(SMALL('[2]Day 1 (All)'!O$3:O$152,A88)))","v":83}]
[86,{"$f":"IF(I89=\"\",\"\",IF(ISNA(VLOOKUP($D89,'[2]Teams & Anglers'!$B$7:$F$156,1,FALSE))=TRUE,\"\",VLOOKUP($D89,'[2]Teams & Anglers'!$B$7:$F$1566,4,FALSE)))","v":"NELSON, Ian"},{"$f":"IF(ISNA(VLOOKUP($D89,'[2]Teams & Anglers'!$B$7:$F$156,1,FALSE))=TRUE,\"\",VLOOKUP($D89,'[2]Teams & Anglers'!$B$7:$F$1566,3,FALSE))","v":79},{"$f":"IF(I89=\"\",\"\",INDEX('[2]Day 1 (All)'!$AA$3:$AA$152,SMALL(IF('[2]Day 1 (All)'!$O$3:$O$152=$I89,ROW('[2]Day 1 (All)'!$O$3:$O$152)-ROW(I$4)+2),COUNTIF($I$4:$I89,$I89))))","v":73},{"$f":"IF($B89=\"\",\"\",IF(ISNA(VLOOKUP($C89,'[2]Day 1 (All)'!$Y$3:$Z$300,1,FALSE))=TRUE,0,VLOOKUP($D89,'[2]Day 1 data entry'!C$3:X$152,19,FALSE)))","v":7},0,2.3333333333333335,{"$f":"IF($B89=\"\",\"\",IF(ISNA(VLOOKUP($C89,'[2]Day 1 (All)'!$Y$3:$Z$300,1,FALSE))=TRUE,0,VLOOKUP($D89,'[2]Day 1 data entry'!C$3:X$152,22,FALSE)))","v":"DAB"},{"$f":"IF(ISERROR(SMALL('[2]Day 1 (All)'!O$3:O$152,A89))=TRUE,\"\",(SMALL('[2]Day 1 (All)'!O$3:O$152,A89)))","v":83}]
[87,{"$f":"IF(I90=\"\",\"\",IF(ISNA(VLOOKUP($D90,'[2]Teams & Anglers'!$B$7:$F$156,1,FALSE))=TRUE,\"\",VLOOKUP($D90,'[2]Teams & Anglers'!$B$7:$F$1566,4,FALSE)))","v":"DENHOLM, Paul"},{"$f":"IF(ISNA(VLOOKUP($D90,'[2]Teams & Anglers'!$B$7:$F$156,1,FALSE))=TRUE,\"\",VLOOKUP($D90,'[2]Teams & Anglers'!$B$7:$F$1566,3,FALSE))","v":32},{"$f":"IF(I90=\"\",\"\",INDEX('[2]Day 1 (All)'!$AA$3:$AA$152,SMALL(IF('[2]Day 1 (All)'!$O$3:$O$152=$I90,ROW('[2]Day 1 (All)'!$O$3:$O$152)-ROW(I$4)+2),COUNTIF($I$4:$I90,$I90))))","v":38},{"$f":"IF($B90=\"\",\"\",IF(ISNA(VLOOKUP($C90,'[2]Day 1 (All)'!$Y$3:$Z$300,1,FALSE))=TRUE,0,VLOOKUP($D90,'[2]Day 1 data entry'!C$3:X$152,19,FALSE)))","v":6},0,2,{"$f":"IF($B90=\"\",\"\",IF(ISNA(VLOOKUP($C90,'[2]Day 1 (All)'!$Y$3:$Z$300,1,FALSE))=TRUE,0,VLOOKUP($D90,'[2]Day 1 data entry'!C$3:X$152,22,FALSE)))","v":"DAB"},{"$f":"IF(ISERROR(SMALL('[2]Day 1 (All)'!O$3:O$152,A90))=TRUE,\"\",(SMALL('[2]Day 1 (All)'!O$3:O$152,A90)))","v":87}]
[88,{"$f":"IF(I91=\"\",\"\",IF(ISNA(VLOOKUP($D91,'[2]Teams & Anglers'!$B$7:$F$156,1,FALSE))=TRUE,\"\",VLOOKUP($D91,'[2]Teams & Anglers'!$B$7:$F$1566,4,FALSE)))","v":"FRENCH, Julian"},{"$f":"IF(ISNA(VLOOKUP($D91,'[2]Teams & Anglers'!$B$7:$F$156,1,FALSE))=TRUE,\"\",VLOOKUP($D91,'[2]Teams & Anglers'!$B$7:$F$1566,3,FALSE))","v":42},{"$f":"IF(I91=\"\",\"\",INDEX('[2]Day 1 (All)'!$AA$3:$AA$152,SMALL(IF('[2]Day 1 (All)'!$O$3:$O$152=$I91,ROW('[2]Day 1 (All)'!$O$3:$O$152)-ROW(I$4)+2),COUNTIF($I$4:$I91,$I91))))","v":79},{"$f":"IF($B91=\"\",\"\",IF(ISNA(VLOOKUP($C91,'[2]Day 1 (All)'!$Y$3:$Z$300,1,FALSE))=TRUE,0,VLOOKUP($D91,'[2]Day 1 data entry'!C$3:X$152,19,FALSE)))","v":6},0,2,{"$f":"IF($B91=\"\",\"\",IF(ISNA(VLOOKUP($C91,'[2]Day 1 (All)'!$Y$3:$Z$300,1,FALSE))=TRUE,0,VLOOKUP($D91,'[2]Day 1 data entry'!C$3:X$152,22,FALSE)))","v":"DAB"},{"$f":"IF(ISERROR(SMALL('[2]Day 1 (All)'!O$3:O$152,A91))=TRUE,\"\",(SMALL('[2]Day 1 (All)'!O$3:O$152,A91)))","v":87}]
[89,{"$f":"IF(I92=\"\",\"\",IF(ISNA(VLOOKUP($D92,'[2]Teams & Anglers'!$B$7:$F$156,1,FALSE))=TRUE,\"\",VLOOKUP($D92,'[2]Teams & Anglers'!$B$7:$F$1566,4,FALSE)))","v":"WICKS, Maralyn"},{"$f":"IF(ISNA(VLOOKUP($D92,'[2]Teams & Anglers'!$B$7:$F$156,1,FALSE))=TRUE,\"\",VLOOKUP($D92,'[2]Teams & Anglers'!$B$7:$F$1566,3,FALSE))","v":122},{"$f":"IF(I92=\"\",\"\",INDEX('[2]Day 1 (All)'!$AA$3:$AA$152,SMALL(IF('[2]Day 1 (All)'!$O$3:$O$152=$I92,ROW('[2]Day 1 (All)'!$O$3:$O$152)-ROW(I$4)+2),COUNTIF($I$4:$I92,$I92))))","v":112},{"$f":"IF($B92=\"\",\"\",IF(ISNA(VLOOKUP($C92,'[2]Day 1 (All)'!$Y$3:$Z$300,1,FALSE))=TRUE,0,VLOOKUP($D92,'[2]Day 1 data entry'!C$3:X$152,19,FALSE)))","v":5},0,1.6666666666666667,{"$f":"IF($B92=\"\",\"\",IF(ISNA(VLOOKUP($C92,'[2]Day 1 (All)'!$Y$3:$Z$300,1,FALSE))=TRUE,0,VLOOKUP($D92,'[2]Day 1 data entry'!C$3:X$152,22,FALSE)))","v":"DAB"},{"$f":"IF(ISERROR(SMALL('[2]Day 1 (All)'!O$3:O$152,A92))=TRUE,\"\",(SMALL('[2]Day 1 (All)'!O$3:O$152,A92)))","v":89}]

{"sheet":"Bass Fest. Day 2 Heaviest Flat","index":29,"n_rows":113,"n_cols":9,"rows_kept":113,"cut":false,"hidden":false,"merged":[[0,1,0,3],[0,4,0,8],[1,0,2,0],[1,1,2,1],[1,2,2,2],[1,3,2,3],[1,4,2,4],[1,7,2,7],[1,8,2,8]]}
[null,"BASS FESTIVAL 2020-21",null,null,"Day 2 - Heaviest Flat"]
["Individual No.","Angler Name","Angler No.","Peg","Fish Points","Weight",null,"Species","Day 2 Position"]
[null,null,null,null,null,"lbs","oz"]
[1,"COOPER, Sam",25,65,64,1,5.333333333333333,"FLOUNDER",1]
[2,"TUCK, Rob",116,77,64,1,5.333333333333333,"FLOUNDER",1]
[3,"CROSBY, Ralf",29,13,56,1,2.6666666666666665,"FLOUNDER",3]
[4,"STEBBINGS, Robert",108,83,52,1,1.3333333333333333,"FLOUNDER",4]
[5,"BALL, Keith",8,11,48,1,0,"FLOUNDER",5]
[6,"MOORING, Luke",76,62,48,1,0,"FLOUNDER",5]
[7,"SHORTHOUSE, Dave",102,12,44,0,14.666666666666666,"FLOUNDER",7]
[8,"PEARCE, Vic",85,21,44,0,14.666666666666666,"FLOUNDER",7]
[9,"LINDFIELD, Bill",71,95,44,0,14.666666666666666,"FLOUNDER",7]
[10,"FRENCH, Julian",42,24,40,0,13.333333333333334,"FLOUNDER",10]
[11,"PERRY, Joe",87,25,40,0,13.333333333333334,"FLOUNDER",10]
[12,"TAYLOR, Mark",110,8,36,0,12,"FLOUNDER",12]
[13,"SMITH, George",104,128,36,0,12,"SOLE",12]
[14,"BANHAM, Jason",10,6,32,0,10.666666666666666,"DAB",14]
[15,"NANGLE, Karl",78,18,32,0,10.666666666666666,"FLOUNDER",14]
[16,"DAWBER, Simon",31,69,32,0,10.666666666666666,"FLOUNDER",14]
[17,"GOOCH, Mark",47,82,32,0,10.666666666666666,"FLOUNDER",14]
[18,"GARDINER, Gareth",44,1,28,0,9.3333333333333339,"FLOUNDER",18]
[19,"FALK, Dave",39,32,28,0,9.3333333333333339,"FLOUNDER",18]
[20,"GREEN, Kevin",48,61,28,0,9.3333333333333339,"FLOUNDER",18]
[21,"ELLIOTT, Nathan",38,64,28,0,9.3333333333333339,"FLOUNDER",18]
[22,"PAGE, Saul",81,66,28,0,9.3333333333333339,"FLOUNDER",18]
[23,"AUSTIN, John",7,74,28,0,9.3333333333333339,"DAB",18]
[24,"HIGHFIELD, Nik",55,78,28,0,9.3333333333333339,"DAB",18]
[25,"GALLACHER, Andy",43,119,28,0,9.3333333333333339,"DAB",18]
[26,"PEMBERTON, Andy",86,5,24,0,8,"FLOUNDER",26]
[27,"PRICE, Ben",91,41,24,0,8,"DAB",26]
[28,"SMITH, Stephen",106,53,24,0,8,"FLOUNDER",26]
[29,"HAZELGROVE, Gary",53,55,24,0,8,"DAB",26]
[30,"PARKER, Daniel",83,57,24,0,8,"FLOUNDER",26]
[31,"ROYALL, Tony ",97,63,24,0,8,"DAB",26]
[32,"COTTER, Brett",26,73,24,0,8,"DAB",26]
[33,"DENHOLM, Paul",32,80,24,0,8,"DAB",26]
[34,"WELLS, Thomas",120,91,24,0,8,"FLOUNDER",26]
[35,"THORNTON, Lee",112,94,24,0,8,"DAB",26]
[36,"CROSBY, Colin",28,121,24,0,8,"DAB",26]
[37,"BUY, Craig",21,122,24,0,8,"DAB",26]
[38,"BOND, Darren",13,127,24,0,8,"DAB",26]
[39,"GASCOIGNE, Robert",45,9,21,0,7,"FLOUNDER",39]
[40,"MARTLAND, Kev",73,10,21,0,7,"FLOUNDER",39]
[41,"WRIGHT, Dave",123,27,21,0,7,"FLOUNDER",39]
[42,"WOOD, Gary",124,31,21,0,7,"DAB",39]
[43,"ADAMS, Stephen",2,51,21,0,7,"FLOUNDER",39]
[44,"LEE, Phil",69,71,21,0,7,"FLOUNDER",39]
[45,"DRAYTON, Simon",36,84,21,0,7,"DAB",39]
[46,"BURT, Richard",20,88,21,0,7,"FLOUNDER",39]
[47,"COOPER, Phillip",24,89,21,0,7,"DAB",39]
[48,"CLEMENT, Alby",23,93,21,0,7,"DAB",39]
[49,"ARCH, Joe",6,97,21,0,7,"DAB",39]
[50,"ROGERS, Mark",95,99,21,0,7,"DAB",39]
[51,"YALLOP, Stephen",126,100,21,0,7,"DAB",39]
[52,"DIAPER, Greg",34,105,21,0,7,"DAB",39]
[53,"LILL, Jarrod",70,111,21,0,7,"FLOUNDER",39]
[54,"McGILLOWAY, Wayne",75,117,21,0,7,"DAB",39]
[55,"SMART, Neil",103,3,18,0,6,"FLOUNDER",55]
[56,"SPALL, Chris",107,4,18,0,6,"DAB",55]
[57,"LEE, Martin",68,17,18,0,6,"DAB",55]
[58,"HUTCHINSON, Dave",59,22,18,0,6,"DAB",55]
[59,"DOY, Alan",35,39,18,0,6,"DAB",55]
[60,"CUTLER, Neil",30,40,18,0,6,"DAB",55]
[61,"HARVEY, Paul ",52,44,18,0,6,"DAB",55]
[62,"NELSON, Ian",79,59,18,0,6,"DAB",55]
[63,"DIAPER, Barry",33,67,18,0,6,"DAB",55]
[64,"THOMAS, Tony",111,68,18,0,6,"DAB",55]
[65,"JOHNSON, Billy",61,72,18,0,6,"FLOUNDER",55]
[66,"McCOY, Kenny",74,81,18,0,6,"DAB",55]
[67,"TOPPING, Mike",115,87,18,0,6,"FLOUNDER",55]
[68,"WATTS, Mike",119,103,18,0,6,"DAB",55]
[69,"BANCROFT, Dave",9,109,18,0,6,"DAB",55]
[70,"FRARY, Charlie",40,112,18,0,6,"DAB",55]
[71,"PLUMSTEAD, Joe",89,115,18,0,6,"DAB",55]
[72,"HENNEY, Jimmy",54,118,18,0,6,"DAB",55]
[73,"THORPE, Doug",113,123,18,0,6,"DAB",55]
[74,"SMITH, Leon",105,125,18,0,6,"DAB",55]
[75,"HARRISON, Paul",51,2,16,0,5.333333333333333,"DAB",75]
[76,"PRICE, Jimmy",92,15,16,0,5.333333333333333,"DAB",75]
[77,"KIMBLE, John",62,19,16,0,5.333333333333333,"DAB",75]
[78,"WICKS, Maralyn",122,26,16,0,5.333333333333333,"DAB",75]
[79,"PROVINS, Colin",93,30,16,0,5.333333333333333,"DAB",75]
[80,"SELF, Bevan",100,33,16,0,5.333333333333333,"BASS",75]
[81,"TURNER, Cameron",117,37,16,0,5.333333333333333,"DAB",75]
[82,"WHITE, Alan",121,52,16,0,5.333333333333333,"DAB",75]
[83,"RUSSELL, Shane",98,58,16,0,5.333333333333333,"DAB",75]
[84,"BOWELL, Ian",16,75,16,0,5.333333333333333,"FLOUNDER",75]
[85,"TOPPING, Jack",114,86,16,0,5.333333333333333,"DAB",75]
[86,"SERBAN, Nelu",101,92,16,0,5.333333333333333,"FLOUNDER",75]
[87,"AKESTER, Jack",3,102,16,0,5.333333333333333,"DAB",75]
[88,"HIPPERSON, Richard",57,108,16,0,5.333333333333333,"DAB",75]
[89,"WALES, Joe",118,114,16,0,5.333333333333333,"DAB",75]
[90,"HANCOX, Karen",50,116,16,0,5.333333333333333,"DAB",75]
[91,"HADDOCK, Roy",49,120,16,0,5.333333333333333,"DAB",75]
[92,"HUTSON, Garry",60,126,16,0,5.333333333333333,"DAB",75]
[93,"ROBERTS, Steve",94,14,14,0,4.666666666666667,"DAB",93]
[94,"STORER, Paul",109,35,14,0,4.666666666666667,"DAB",93]
[95,"BORDIANU, Adrian",14,38,14,0,4.666666666666667,"DAB",93]
[96,"RYDER, Edde",99,49,14,0,4.666666666666667,"DAB",93]
[97,"PINDER, Mark",88,60,14,0,4.666666666666667,"DAB",93]
[98,"LAY-FLURRIE, Matt",66,76,14,0,4.666666666666667,"DAB",93]
[99,"EDWARDS, Lee",37,85,14,0,4.666666666666667,"DAB",93]
[100,"YALLOP, Oliver",125,90,14,0,4.666666666666667,"DAB",93]
[101,"FRARY, June",41,113,14,0,4.666666666666667,"DAB",93]
[102,"LAMBERT, Ian",65,36,12,0,4,"DAB",102]
[103,"PRICE, Alan",90,47,12,0,4,"DAB",102]
[104,"KINGDON, Adam",63,48,12,0,4,"SOLE",102]
[105,"BOTEZATO, Constantin",15,56,12,0,4,"DAB",102]
[106,"CARTER, John",22,110,12,0,4,"DAB",102]
[107,"NICHOLSON, Steven",80,23,10,0,3.3333333333333335,"DAB",107]
[108,"ALDOUS, David",5,28,10,0,3.3333333333333335,"DAB",107]
[109,"BETTINSON, Charles",12,98,10,0,3.3333333333333335,"DAB",107]
[110,"LEE, Louise",67,16,8,0,2.6666666666666665,"DAB",110]

{"sheet":"Final Individual results","index":30,"n_rows":103,"n_cols":17,"rows_kept":103,"cut":false,"hidden":true,"merged":[[1,16,2,16],[1,10,2,10],[1,7,2,7],[1,6,2,6],[1,0,2,0],[1,4,2,4],[1,5,2,5],[1,1,2,1],[1,2,2,2],[1,3,2,3],[0,0,0,7],[1,15,2,15],[1,11,2,11],[1,12,2,12],[1,13,2,13],[1,14,2,14]]}
["HSAC North Norfolk Bass Festival 2013  -  Final Positions ",null,null,null,null,null,null,null,null,null,"Individuals data extraction calculations"]
["Angler Name","Angler No","Total No. Fish","Total No. Fish Points","Day 1 Points","Day 2 Points","Total Points","Overall Position",null,null,"Overall Position","Angler No","Total No. Fish","Total No. Fish Points","Day 1 Points","Day 2 Points","Total Points"]
[]
[{"$f":"VLOOKUP($B4,#REF!,2,FALSE)","v":{"$error":"#N/A"}},{"$f":"VLOOKUP($H4,$K$4:$Q$300,2,FALSE)","v":{"$error":"#N/A"}},{"$f":"VLOOKUP($H4,$K$4:$Q$300,3,FALSE)","v":{"$error":"#N/A"}},{"$f":"VLOOKUP($H4,$K$4:$Q$300,4,FALSE)","v":{"$error":"#N/A"}},{"$f":"VLOOKUP($H4,$K$4:$Q$300,5,FALSE)","v":{"$error":"#N/A"}},{"$f":"VLOOKUP($H4,$K$4:$Q$300,6,FALSE)","v":{"$error":"#N/A"}},{"$f":"VLOOKUP($H4,$K$4:$Q$300,7,FALSE)","v":{"$error":"#N/A"}},{"$f":"IF(ISERROR(H3+1)=TRUE,1,H3+1)","v":1},null,null,{"$f":"IF(Q4=NpZ*NoZ*2,NpZ*NoZ,RANK(Q4,Q$4:Q$300,1))","v":{"$error":"#REF!"}},1,{"$f":"IF(ISNA(VLOOKUP($L4,'All Individuals Day 1 (ALL)'!$C$3:$G$277,4,FALSE)+VLOOKUP($L4,#REF!,4,FALSE))=TRUE,\"\",VLOOKUP($L4,'All Individuals Day 1 (ALL)'!$C$3:$G$277,4,FALSE)+VLOOKUP($L4,#REF!,4,FALSE))","v":{"$error":"#REF!"}},{"$f":"IF(ISNA(VLOOKUP($L4,'All Individuals Day 1 (ALL)'!$C$3:$G$277,5,FALSE)+VLOOKUP($L4,#REF!,5,FALSE))=TRUE,\"\",VLOOKUP($L4,'All Individuals Day 1 (ALL)'!$C$3:$G$277,5,FALSE)+VLOOKUP($L4,#REF!,5,FALSE))","v":{"$error":"#REF!"}},{"$f":"IF(ISNA(VLOOKUP($L4,'All Individuals Day 1 (ALL)'!$C$3:$K$277,8,FALSE))=TRUE,\"\",VLOOKUP($L4,'All Individuals Day 1 (ALL)'!$C$3:$K$277,8,FALSE))","v":13},{"$f":"IF(ISNA(VLOOKUP($L4,#REF!,8,FALSE))=TRUE,\"\",VLOOKUP($L4,#REF!,8,FALSE))","v":{"$error":"#REF!"}},{"$f":"IF(OR(M4=\"\",M4=0),NpZ*2,(O4+P4)-N4/100000-M4/1000000)","v":{"$error":"#REF!"}}]
[{"$f":"VLOOKUP($B5,#REF!,2,FALSE)","v":{"$error":"#N/A"}},{"$error":"#N/A"},{"$error":"#N/A"},{"$error":"#N/A"},{"$error":"#N/A"},{"$error":"#N/A"},{"$error":"#N/A"},{"$f":"IF(ISERROR(H4+1)=TRUE,1,H4+1)","v":2},null,null,{"$error":"#REF!"},2,{"$f":"IF(ISNA(VLOOKUP($L5,'All Individuals Day 1 (ALL)'!$C$3:$G$277,4,FALSE)+VLOOKUP($L5,#REF!,4,FALSE))=TRUE,\"\",VLOOKUP($L5,'All Individuals Day 1 (ALL)'!$C$3:$G$277,4,FALSE)+VLOOKUP($L5,#REF!,4,FALSE))","v":{"$error":"#REF!"}},{"$f":"IF(ISNA(VLOOKUP($L5,'All Individuals Day 1 (ALL)'!$C$3:$G$277,5,FALSE)+VLOOKUP($L5,#REF!,5,FALSE))=TRUE,\"\",VLOOKUP($L5,'All Individuals Day 1 (ALL)'!$C$3:$G$277,5,FALSE)+VLOOKUP($L5,#REF!,5,FALSE))","v":{"$error":"#REF!"}},{"$f":"IF(ISNA(VLOOKUP($L5,'All Individuals Day 1 (ALL)'!$C$3:$K$277,8,FALSE))=TRUE,\"\",VLOOKUP($L5,'All Individuals Day 1 (ALL)'!$C$3:$K$277,8,FALSE))","v":5},{"$f":"IF(ISNA(VLOOKUP($L5,#REF!,8,FALSE))=TRUE,\"\",VLOOKUP($L5,#REF!,8,FALSE))","v":{"$error":"#REF!"}},{"$error":"#REF!"}]
[{"$f":"VLOOKUP($B6,#REF!,2,FALSE)","v":{"$error":"#N/A"}},{"$error":"#N/A"},{"$error":"#N/A"},{"$error":"#N/A"},{"$error":"#N/A"},{"$error":"#N/A"},{"$error":"#N/A"},3,null,null,{"$error":"#REF!"},3,{"$f":"IF(ISNA(VLOOKUP($L6,'All Individuals Day 1 (ALL)'!$C$3:$G$277,4,FALSE)+VLOOKUP($L6,#REF!,4,FALSE))=TRUE,\"\",VLOOKUP($L6,'All Individuals Day 1 (ALL)'!$C$3:$G$277,4,FALSE)+VLOOKUP($L6,#REF!,4,FALSE))","v":{"$error":"#REF!"}},{"$f":"IF(ISNA(VLOOKUP($L6,'All Individuals Day 1 (ALL)'!$C$3:$G$277,5,FALSE)+VLOOKUP($L6,#REF!,5,FALSE))=TRUE,\"\",VLOOKUP($L6,'All Individuals Day 1 (ALL)'!$C$3:$G$277,5,FALSE)+VLOOKUP($L6,#REF!,5,FALSE))","v":{"$error":"#REF!"}},{"$f":"IF(ISNA(VLOOKUP($L6,'All Individuals Day 1 (ALL)'!$C$3:$K$277,8,FALSE))=TRUE,\"\",VLOOKUP($L6,'All Individuals Day 1 (ALL)'!$C$3:$K$277,8,FALSE))","v":11},{"$f":"IF(ISNA(VLOOKUP($L6,#REF!,8,FALSE))=TRUE,\"\",VLOOKUP($L6,#REF!,8,FALSE))","v":{"$error":"#REF!"}},{"$error":"#REF!"}]
[{"$f":"VLOOKUP($B7,#REF!,2,FALSE)","v":{"$error":"#N/A"}},{"$error":"#N/A"},{"$error":"#N/A"},{"$error":"#N/A"},{"$error":"#N/A"},{"$error":"#N/A"},{"$error":"#N/A"},4,null,null,{"$error":"#REF!"},4,{"$f":"IF(ISNA(VLOOKUP($L7,'All Individuals Day 1 (ALL)'!$C$3:$G$277,4,FALSE)+VLOOKUP($L7,#REF!,4,FALSE))=TRUE,\"\",VLOOKUP($L7,'All Individuals Day 1 (ALL)'!$C$3:$G$277,4,FALSE)+VLOOKUP($L7,#REF!,4,FALSE))","v":{"$error":"#REF!"}},{"$f":"IF(ISNA(VLOOKUP($L7,'All Individuals Day 1 (ALL)'!$C$3:$G$277,5,FALSE)+VLOOKUP($L7,#REF!,5,FALSE))=TRUE,\"\",VLOOKUP($L7,'All Individuals Day 1 (ALL)'!$C$3:$G$277,5,FALSE)+VLOOKUP($L7,#REF!,5,FALSE))","v":{"$error":"#REF!"}},{"$f":"IF(ISNA(VLOOKUP($L7,'All Individuals Day 1 (ALL)'!$C$3:$K$277,8,FALSE))=TRUE,\"\",VLOOKUP($L7,'All Individuals Day 1 (ALL)'!$C$3:$K$277,8,FALSE))","v":15},{"$f":"IF(ISNA(VLOOKUP($L7,#REF!,8,FALSE))=TRUE,\"\",VLOOKUP($L7,#REF!,8,FALSE))","v":{"$error":"#REF!"}},{"$error":"#REF!"}]
[{"$f":"VLOOKUP($B8,#REF!,2,FALSE)","v":{"$error":"#N/A"}},{"$error":"#N/A"},{"$error":"#N/A"},{"$error":"#N/A"},{"$error":"#N/A"},{"$error":"#N/A"},{"$error":"#N/A"},5,null,null,{"$error":"#REF!"},5,{"$f":"IF(ISNA(VLOOKUP($L8,'All Individuals Day 1 (ALL)'!$C$3:$G$277,4,FALSE)+VLOOKUP($L8,#REF!,4,FALSE))=TRUE,\"\",VLOOKUP($L8,'All Individuals Day 1 (ALL)'!$C$3:$G$277,4,FALSE)+VLOOKUP($L8,#REF!,4,FALSE))","v":{"$error":"#REF!"}},{"$f":"IF(ISNA(VLOOKUP($L8,'All Individuals Day 1 (ALL)'!$C$3:$G$277,5,FALSE)+VLOOKUP($L8,#REF!,5,FALSE))=TRUE,\"\",VLOOKUP($L8,'All Individuals Day 1 (ALL)'!$C$3:$G$277,5,FALSE)+VLOOKUP($L8,#REF!,5,FALSE))","v":{"$error":"#REF!"}},{"$f":"IF(ISNA(VLOOKUP($L8,'All Individuals Day 1 (ALL)'!$C$3:$K$277,8,FALSE))=TRUE,\"\",VLOOKUP($L8,'All Individuals Day 1 (ALL)'!$C$3:$K$277,8,FALSE))","v":6},{"$f":"IF(ISNA(VLOOKUP($L8,#REF!,8,FALSE))=TRUE,\"\",VLOOKUP($L8,#REF!,8,FALSE))","v":{"$error":"#REF!"}},{"$error":"#REF!"}]
[{"$f":"VLOOKUP($B9,#REF!,2,FALSE)","v":{"$error":"#N/A"}},{"$error":"#N/A"},{"$error":"#N/A"},{"$error":"#N/A"},{"$error":"#N/A"},{"$error":"#N/A"},{"$error":"#N/A"},6,null,null,{"$error":"#REF!"},6,{"$f":"IF(ISNA(VLOOKUP($L9,'All Individuals Day 1 (ALL)'!$C$3:$G$277,4,FALSE)+VLOOKUP($L9,#REF!,4,FALSE))=TRUE,\"\",VLOOKUP($L9,'All Individuals Day 1 (ALL)'!$C$3:$G$277,4,FALSE)+VLOOKUP($L9,#REF!,4,FALSE))","v":{"$error":"#REF!"}},{"$f":"IF(ISNA(VLOOKUP($L9,'All Individuals Day 1 (ALL)'!$C$3:$G$277,5,FALSE)+VLOOKUP($L9,#REF!,5,FALSE))=TRUE,\"\",VLOOKUP($L9,'All Individuals Day 1 (ALL)'!$C$3:$G$277,5,FALSE)+VLOOKUP($L9,#REF!,5,FALSE))","v":{"$error":"#REF!"}},{"$f":"IF(ISNA(VLOOKUP($L9,'All Individuals Day 1 (ALL)'!$C$3:$K$277,8,FALSE))=TRUE,\"\",VLOOKUP($L9,'All Individuals Day 1 (ALL)'!$C$3:$K$277,8,FALSE))","v":4},{"$f":"IF(ISNA(VLOOKUP($L9,#REF!,8,FALSE))=TRUE,\"\",VLOOKUP($L9,#REF!,8,FALSE))","v":{"$error":"#REF!"}},{"$error":"#REF!"}]
[{"$f":"VLOOKUP($B10,#REF!,2,FALSE)","v":{"$error":"#N/A"}},{"$error":"#N/A"},{"$error":"#N/A"},{"$error":"#N/A"},{"$error":"#N/A"},{"$error":"#N/A"},{"$error":"#N/A"},7,null,null,{"$error":"#REF!"},7,{"$f":"IF(ISNA(VLOOKUP($L10,'All Individuals Day 1 (ALL)'!$C$3:$G$277,4,FALSE)+VLOOKUP($L10,#REF!,4,FALSE))=TRUE,\"\",VLOOKUP($L10,'All Individuals Day 1 (ALL)'!$C$3:$G$277,4,FALSE)+VLOOKUP($L10,#REF!,4,FALSE))","v":{"$error":"#REF!"}},{"$f":"IF(ISNA(VLOOKUP($L10,'All Individuals Day 1 (ALL)'!$C$3:$G$277,5,FALSE)+VLOOKUP($L10,#REF!,5,FALSE))=TRUE,\"\",VLOOKUP($L10,'All Individuals Day 1 (ALL)'!$C$3:$G$277,5,FALSE)+VLOOKUP($L10,#REF!,5,FALSE))","v":{"$error":"#REF!"}},{"$f":"IF(ISNA(VLOOKUP($L10,'All Individuals Day 1 (ALL)'!$C$3:$K$277,8,FALSE))=TRUE,\"\",VLOOKUP($L10,'All Individuals Day 1 (ALL)'!$C$3:$K$277,8,FALSE))","v":13},{"$f":"IF(ISNA(VLOOKUP($L10,#REF!,8,FALSE))=TRUE,\"\",VLOOKUP($L10,#REF!,8,FALSE))","v":{"$error":"#REF!"}},{"$error":"#REF!"}]
[{"$f":"VLOOKUP($B11,#REF!,2,FALSE)","v":{"$error":"#N/A"}},{"$error":"#N/A"},{"$error":"#N/A"},{"$error":"#N/A"},{"$error":"#N/A"},{"$error":"#N/A"},{"$error":"#N/A"},8,null,null,{"$error":"#REF!"},8,{"$f":"IF(ISNA(VLOOKUP($L11,'All Individuals Day 1 (ALL)'!$C$3:$G$277,4,FALSE)+VLOOKUP($L11,#REF!,4,FALSE))=TRUE,\"\",VLOOKUP($L11,'All Individuals Day 1 (ALL)'!$C$3:$G$277,4,FALSE)+VLOOKUP($L11,#REF!,4,FALSE))","v":{"$error":"#REF!"}},{"$f":"IF(ISNA(VLOOKUP($L11,'All Individuals Day 1 (ALL)'!$C$3:$G$277,5,FALSE)+VLOOKUP($L11,#REF!,5,FALSE))=TRUE,\"\",VLOOKUP($L11,'All Individuals Day 1 (ALL)'!$C$3:$G$277,5,FALSE)+VLOOKUP($L11,#REF!,5,FALSE))","v":{"$error":"#REF!"}},{"$f":"IF(ISNA(VLOOKUP($L11,'All Individuals Day 1 (ALL)'!$C$3:$K$277,8,FALSE))=TRUE,\"\",VLOOKUP($L11,'All Individuals Day 1 (ALL)'!$C$3:$K$277,8,FALSE))","v":15},{"$f":"IF(ISNA(VLOOKUP($L11,#REF!,8,FALSE))=TRUE,\"\",VLOOKUP($L11,#REF!,8,FALSE))","v":{"$error":"#REF!"}},{"$error":"#REF!"}]
[{"$f":"VLOOKUP($B12,#REF!,2,FALSE)","v":{"$error":"#N/A"}},{"$error":"#N/A"},{"$error":"#N/A"},{"$error":"#N/A"},{"$error":"#N/A"},{"$error":"#N/A"},{"$error":"#N/A"},9,null,null,{"$error":"#REF!"},9,{"$f":"IF(ISNA(VLOOKUP($L12,'All Individuals Day 1 (ALL)'!$C$3:$G$277,4,FALSE)+VLOOKUP($L12,#REF!,4,FALSE))=TRUE,\"\",VLOOKUP($L12,'All Individuals Day 1 (ALL)'!$C$3:$G$277,4,FALSE)+VLOOKUP($L12,#REF!,4,FALSE))","v":{"$error":"#REF!"}},{"$f":"IF(ISNA(VLOOKUP($L12,'All Individuals Day 1 (ALL)'!$C$3:$G$277,5,FALSE)+VLOOKUP($L12,#REF!,5,FALSE))=TRUE,\"\",VLOOKUP($L12,'All Individuals Day 1 (ALL)'!$C$3:$G$277,5,FALSE)+VLOOKUP($L12,#REF!,5,FALSE))","v":{"$error":"#REF!"}},{"$f":"IF(ISNA(VLOOKUP($L12,'All Individuals Day 1 (ALL)'!$C$3:$K$277,8,FALSE))=TRUE,\"\",VLOOKUP($L12,'All Individuals Day 1 (ALL)'!$C$3:$K$277,8,FALSE))","v":8},{"$f":"IF(ISNA(VLOOKUP($L12,#REF!,8,FALSE))=TRUE,\"\",VLOOKUP($L12,#REF!,8,FALSE))","v":{"$error":"#REF!"}},{"$error":"#REF!"}]
[{"$f":"VLOOKUP($B13,#REF!,2,FALSE)","v":{"$error":"#N/A"}},{"$error":"#N/A"},{"$error":"#N/A"},{"$error":"#N/A"},{"$error":"#N/A"},{"$error":"#N/A"},{"$error":"#N/A"},10,null,null,{"$error":"#REF!"},10,{"$f":"IF(ISNA(VLOOKUP($L13,'All Individuals Day 1 (ALL)'!$C$3:$G$277,4,FALSE)+VLOOKUP($L13,#REF!,4,FALSE))=TRUE,\"\",VLOOKUP($L13,'All Individuals Day 1 (ALL)'!$C$3:$G$277,4,FALSE)+VLOOKUP($L13,#REF!,4,FALSE))","v":{"$error":"#REF!"}},{"$f":"IF(ISNA(VLOOKUP($L13,'All Individuals Day 1 (ALL)'!$C$3:$G$277,5,FALSE)+VLOOKUP($L13,#REF!,5,FALSE))=TRUE,\"\",VLOOKUP($L13,'All Individuals Day 1 (ALL)'!$C$3:$G$277,5,FALSE)+VLOOKUP($L13,#REF!,5,FALSE))","v":{"$error":"#REF!"}},{"$f":"IF(ISNA(VLOOKUP($L13,'All Individuals Day 1 (ALL)'!$C$3:$K$277,8,FALSE))=TRUE,\"\",VLOOKUP($L13,'All Individuals Day 1 (ALL)'!$C$3:$K$277,8,FALSE))","v":11},{"$f":"IF(ISNA(VLOOKUP($L13,#REF!,8,FALSE))=TRUE,\"\",VLOOKUP($L13,#REF!,8,FALSE))","v":{"$error":"#REF!"}},{"$error":"#REF!"}]
[{"$f":"VLOOKUP($B14,#REF!,2,FALSE)","v":{"$error":"#N/A"}},{"$error":"#N/A"},{"$error":"#N/A"},{"$error":"#N/A"},{"$error":"#N/A"},{"$error":"#N/A"},{"$error":"#N/A"},11,null,null,{"$error":"#REF!"},11,{"$f":"IF(ISNA(VLOOKUP($L14,'All Individuals Day 1 (ALL)'!$C$3:$G$277,4,FALSE)+VLOOKUP($L14,#REF!,4,FALSE))=TRUE,\"\",VLOOKUP($L14,'All Individuals Day 1 (ALL)'!$C$3:$G$277,4,FALSE)+VLOOKUP($L14,#REF!,4,FALSE))","v":{"$error":"#REF!"}},{"$f":"IF(ISNA(VLOOKUP($L14,'All Individuals Day 1 (ALL)'!$C$3:$G$277,5,FALSE)+VLOOKUP($L14,#REF!,5,FALSE))=TRUE,\"\",VLOOKUP($L14,'All Individuals Day 1 (ALL)'!$C$3:$G$277,5,FALSE)+VLOOKUP($L14,#REF!,5,FALSE))","v":{"$error":"#REF!"}},{"$f":"IF(ISNA(VLOOKUP($L14,'All Individuals Day 1 (ALL)'!$C$3:$K$277,8,FALSE))=TRUE,\"\",VLOOKUP($L14,'All Individuals Day 1 (ALL)'!$C$3:$K$277,8,FALSE))","v":13},{"$f":"IF(ISNA(VLOOKUP($L14,#REF!,8,FALSE))=TRUE,\"\",VLOOKUP($L14,#REF!,8,FALSE))","v":{"$error":"#REF!"}},{"$error":"#REF!"}]
[{"$f":"VLOOKUP($B15,#REF!,2,FALSE)","v":{"$error":"#N/A"}},{"$error":"#N/A"},{"$error":"#N/A"},{"$error":"#N/A"},{"$error":"#N/A"},{"$error":"#N/A"},{"$error":"#N/A"},12,null,null,{"$error":"#REF!"},12,{"$f":"IF(ISNA(VLOOKUP($L15,'All Individuals Day 1 (ALL)'!$C$3:$G$277,4,FALSE)+VLOOKUP($L15,#REF!,4,FALSE))=TRUE,\"\",VLOOKUP($L15,'All Individuals Day 1 (ALL)'!$C$3:$G$277,4,FALSE)+VLOOKUP($L15,#REF!,4,FALSE))","v":{"$error":"#REF!"}},{"$f":"IF(ISNA(VLOOKUP($L15,'All Individuals Day 1 (ALL)'!$C$3:$G$277,5,FALSE)+VLOOKUP($L15,#REF!,5,FALSE))=TRUE,\"\",VLOOKUP($L15,'All Individuals Day 1 (ALL)'!$C$3:$G$277,5,FALSE)+VLOOKUP($L15,#REF!,5,FALSE))","v":{"$error":"#REF!"}},{"$f":"IF(ISNA(VLOOKUP($L15,'All Individuals Day 1 (ALL)'!$C$3:$K$277,8,FALSE))=TRUE,\"\",VLOOKUP($L15,'All Individuals Day 1 (ALL)'!$C$3:$K$277,8,FALSE))","v":15},{"$f":"IF(ISNA(VLOOKUP($L15,#REF!,8,FALSE))=TRUE,\"\",VLOOKUP($L15,#REF!,8,FALSE))","v":{"$error":"#REF!"}},{"$error":"#REF!"}]
[{"$f":"VLOOKUP($B16,#REF!,2,FALSE)","v":{"$error":"#N/A"}},{"$error":"#N/A"},{"$error":"#N/A"},{"$error":"#N/A"},{"$error":"#N/A"},{"$error":"#N/A"},{"$error":"#N/A"},13,null,null,{"$error":"#REF!"},13,{"$f":"IF(ISNA(VLOOKUP($L16,'All Individuals Day 1 (ALL)'!$C$3:$G$277,4,FALSE)+VLOOKUP($L16,#REF!,4,FALSE))=TRUE,\"\",VLOOKUP($L16,'All Individuals Day 1 (ALL)'!$C$3:$G$277,4,FALSE)+VLOOKUP($L16,#REF!,4,FALSE))","v":{"$error":"#REF!"}},{"$f":"IF(ISNA(VLOOKUP($L16,'All Individuals Day 1 (ALL)'!$C$3:$G$277,5,FALSE)+VLOOKUP($L16,#REF!,5,FALSE))=TRUE,\"\",VLOOKUP($L16,'All Individuals Day 1 (ALL)'!$C$3:$G$277,5,FALSE)+VLOOKUP($L16,#REF!,5,FALSE))","v":{"$error":"#REF!"}},{"$f":"IF(ISNA(VLOOKUP($L16,'All Individuals Day 1 (ALL)'!$C$3:$K$277,8,FALSE))=TRUE,\"\",VLOOKUP($L16,'All Individuals Day 1 (ALL)'!$C$3:$K$277,8,FALSE))","v":1},{"$f":"IF(ISNA(VLOOKUP($L16,#REF!,8,FALSE))=TRUE,\"\",VLOOKUP($L16,#REF!,8,FALSE))","v":{"$error":"#REF!"}},{"$error":"#REF!"}]
[{"$f":"VLOOKUP($B17,#REF!,2,FALSE)","v":{"$error":"#N/A"}},{"$error":"#N/A"},{"$error":"#N/A"},{"$error":"#N/A"},{"$error":"#N/A"},{"$error":"#N/A"},{"$error":"#N/A"},14,null,null,{"$error":"#REF!"},14,{"$f":"IF(ISNA(VLOOKUP($L17,'All Individuals Day 1 (ALL)'!$C$3:$G$277,4,FALSE)+VLOOKUP($L17,#REF!,4,FALSE))=TRUE,\"\",VLOOKUP($L17,'All Individuals Day 1 (ALL)'!$C$3:$G$277,4,FALSE)+VLOOKUP($L17,#REF!,4,FALSE))","v":{"$error":"#REF!"}},{"$f":"IF(ISNA(VLOOKUP($L17,'All Individuals Day 1 (ALL)'!$C$3:$G$277,5,FALSE)+VLOOKUP($L17,#REF!,5,FALSE))=TRUE,\"\",VLOOKUP($L17,'All Individuals Day 1 (ALL)'!$C$3:$G$277,5,FALSE)+VLOOKUP($L17,#REF!,5,FALSE))","v":{"$error":"#REF!"}},{"$f":"IF(ISNA(VLOOKUP($L17,'All Individuals Day 1 (ALL)'!$C$3:$K$277,8,FALSE))=TRUE,\"\",VLOOKUP($L17,'All Individuals Day 1 (ALL)'!$C$3:$K$277,8,FALSE))","v":11},{"$f":"IF(ISNA(VLOOKUP($L17,#REF!,8,FALSE))=TRUE,\"\",VLOOKUP($L17,#REF!,8,FALSE))","v":{"$error":"#REF!"}},{"$error":"#REF!"}]
[{"$f":"VLOOKUP($B18,#REF!,2,FALSE)","v":{"$error":"#N/A"}},{"$error":"#N/A"},{"$error":"#N/A"},{"$error":"#N/A"},{"$error":"#N/A"},{"$error":"#N/A"},{"$error":"#N/A"},15,null,null,{"$error":"#REF!"},15,{"$f":"IF(ISNA(VLOOKUP($L18,'All Individuals Day 1 (ALL)'!$C$3:$G$277,4,FALSE)+VLOOKUP($L18,#REF!,4,FALSE))=TRUE,\"\",VLOOKUP($L18,'All Individuals Day 1 (ALL)'!$C$3:$G$277,4,FALSE)+VLOOKUP($L18,#REF!,4,FALSE))","v":{"$error":"#REF!"}},{"$f":"IF(ISNA(VLOOKUP($L18,'All Individuals Day 1 (ALL)'!$C$3:$G$277,5,FALSE)+VLOOKUP($L18,#REF!,5,FALSE))=TRUE,\"\",VLOOKUP($L18,'All Individuals Day 1 (ALL)'!$C$3:$G$277,5,FALSE)+VLOOKUP($L18,#REF!,5,FALSE))","v":{"$error":"#REF!"}},{"$f":"IF(ISNA(VLOOKUP($L18,'All Individuals Day 1 (ALL)'!$C$3:$K$277,8,FALSE))=TRUE,\"\",VLOOKUP($L18,'All Individuals Day 1 (ALL)'!$C$3:$K$277,8,FALSE))","v":12},{"$f":"IF(ISNA(VLOOKUP($L18,#REF!,8,FALSE))=TRUE,\"\",VLOOKUP($L18,#REF!,8,FALSE))","v":{"$error":"#REF!"}},{"$error":"#REF!"}]
[{"$f":"VLOOKUP($B19,#REF!,2,FALSE)","v":{"$error":"#N/A"}},{"$error":"#N/A"},{"$error":"#N/A"},{"$error":"#N/A"},{"$error":"#N/A"},{"$error":"#N/A"},{"$error":"#N/A"},16,null,null,{"$error":"#REF!"},16,{"$f":"IF(ISNA(VLOOKUP($L19,'All Individuals Day 1 (ALL)'!$C$3:$G$277,4,FALSE)+VLOOKUP($L19,#REF!,4,FALSE))=TRUE,\"\",VLOOKUP($L19,'All Individuals Day 1 (ALL)'!$C$3:$G$277,4,FALSE)+VLOOKUP($L19,#REF!,4,FALSE))","v":{"$error":"#REF!"}},{"$f":"IF(ISNA(VLOOKUP($L19,'All Individuals Day 1 (ALL)'!$C$3:$G$277,5,FALSE)+VLOOKUP($L19,#REF!,5,FALSE))=TRUE,\"\",VLOOKUP($L19,'All Individuals Day 1 (ALL)'!$C$3:$G$277,5,FALSE)+VLOOKUP($L19,#REF!,5,FALSE))","v":{"$error":"#REF!"}},{"$f":"IF(ISNA(VLOOKUP($L19,'All Individuals Day 1 (ALL)'!$C$3:$K$277,8,FALSE))=TRUE,\"\",VLOOKUP($L19,'All Individuals Day 1 (ALL)'!$C$3:$K$277,8,FALSE))","v":8},{"$f":"IF(ISNA(VLOOKUP($L19,#REF!,8,FALSE))=TRUE,\"\",VLOOKUP($L19,#REF!,8,FALSE))","v":{"$error":"#REF!"}},{"$error":"#REF!"}]
[{"$f":"VLOOKUP($B20,#REF!,2,FALSE)","v":{"$error":"#N/A"}},{"$error":"#N/A"},{"$error":"#N/A"},{"$error":"#N/A"},{"$error":"#N/A"},{"$error":"#N/A"},{"$error":"#N/A"},17,null,null,{"$error":"#REF!"},17,{"$f":"IF(ISNA(VLOOKUP($L20,'All Individuals Day 1 (ALL)'!$C$3:$G$277,4,FALSE)+VLOOKUP($L20,#REF!,4,FALSE))=TRUE,\"\",VLOOKUP($L20,'All Individuals Day 1 (ALL)'!$C$3:$G$277,4,FALSE)+VLOOKUP($L20,#REF!,4,FALSE))","v":{"$error":"#REF!"}},{"$f":"IF(ISNA(VLOOKUP($L20,'All Individuals Day 1 (ALL)'!$C$3:$G$277,5,FALSE)+VLOOKUP($L20,#REF!,5,FALSE))=TRUE,\"\",VLOOKUP($L20,'All Individuals Day 1 (ALL)'!$C$3:$G$277,5,FALSE)+VLOOKUP($L20,#REF!,5,FALSE))","v":{"$error":"#REF!"}},{"$f":"IF(ISNA(VLOOKUP($L20,'All Individuals Day 1 (ALL)'!$C$3:$K$277,8,FALSE))=TRUE,\"\",VLOOKUP($L20,'All Individuals Day 1 (ALL)'!$C$3:$K$277,8,FALSE))","v":16},{"$f":"IF(ISNA(VLOOKUP($L20,#REF!,8,FALSE))=TRUE,\"\",VLOOKUP($L20,#REF!,8,FALSE))","v":{"$error":"#REF!"}},{"$error":"#REF!"}]
[{"$f":"VLOOKUP($B21,#REF!,2,FALSE)","v":{"$error":"#N/A"}},{"$error":"#N/A"},{"$error":"#N/A"},{"$error":"#N/A"},{"$error":"#N/A"},{"$error":"#N/A"},{"$error":"#N/A"},18,null,null,{"$error":"#REF!"},18,{"$f":"IF(ISNA(VLOOKUP($L21,'All Individuals Day 1 (ALL)'!$C$3:$G$277,4,FALSE)+VLOOKUP($L21,#REF!,4,FALSE))=TRUE,\"\",VLOOKUP($L21,'All Individuals Day 1 (ALL)'!$C$3:$G$277,4,FALSE)+VLOOKUP($L21,#REF!,4,FALSE))","v":{"$error":"#REF!"}},{"$f":"IF(ISNA(VLOOKUP($L21,'All Individuals Day 1 (ALL)'!$C$3:$G$277,5,FALSE)+VLOOKUP($L21,#REF!,5,FALSE))=TRUE,\"\",VLOOKUP($L21,'All Individuals Day 1 (ALL)'!$C$3:$G$277,5,FALSE)+VLOOKUP($L21,#REF!,5,FALSE))","v":{"$error":"#REF!"}},{"$f":"IF(ISNA(VLOOKUP($L21,'All Individuals Day 1 (ALL)'!$C$3:$K$277,8,FALSE))=TRUE,\"\",VLOOKUP($L21,'All Individuals Day 1 (ALL)'!$C$3:$K$277,8,FALSE))","v":9},{"$f":"IF(ISNA(VLOOKUP($L21,#REF!,8,FALSE))=TRUE,\"\",VLOOKUP($L21,#REF!,8,FALSE))","v":{"$error":"#REF!"}},{"$error":"#REF!"}]
[{"$f":"VLOOKUP($B22,#REF!,2,FALSE)","v":{"$error":"#N/A"}},{"$error":"#N/A"},{"$error":"#N/A"},{"$error":"#N/A"},{"$error":"#N/A"},{"$error":"#N/A"},{"$error":"#N/A"},19,null,null,{"$error":"#REF!"},19,{"$f":"IF(ISNA(VLOOKUP($L22,'All Individuals Day 1 (ALL)'!$C$3:$G$277,4,FALSE)+VLOOKUP($L22,#REF!,4,FALSE))=TRUE,\"\",VLOOKUP($L22,'All Individuals Day 1 (ALL)'!$C$3:$G$277,4,FALSE)+VLOOKUP($L22,#REF!,4,FALSE))","v":{"$error":"#REF!"}},{"$f":"IF(ISNA(VLOOKUP($L22,'All Individuals Day 1 (ALL)'!$C$3:$G$277,5,FALSE)+VLOOKUP($L22,#REF!,5,FALSE))=TRUE,\"\",VLOOKUP($L22,'All Individuals Day 1 (ALL)'!$C$3:$G$277,5,FALSE)+VLOOKUP($L22,#REF!,5,FALSE))","v":{"$error":"#REF!"}},{"$f":"IF(ISNA(VLOOKUP($L22,'All Individuals Day 1 (ALL)'!$C$3:$K$277,8,FALSE))=TRUE,\"\",VLOOKUP($L22,'All Individuals Day 1 (ALL)'!$C$3:$K$277,8,FALSE))","v":13},{"$f":"IF(ISNA(VLOOKUP($L22,#REF!,8,FALSE))=TRUE,\"\",VLOOKUP($L22,#REF!,8,FALSE))","v":{"$error":"#REF!"}},{"$error":"#REF!"}]
[{"$f":"VLOOKUP($B23,#REF!,2,FALSE)","v":{"$error":"#N/A"}},{"$error":"#N/A"},{"$error":"#N/A"},{"$error":"#N/A"},{"$error":"#N/A"},{"$error":"#N/A"},{"$error":"#N/A"},20,null,null,{"$error":"#REF!"},20,{"$f":"IF(ISNA(VLOOKUP($L23,'All Individuals Day 1 (ALL)'!$C$3:$G$277,4,FALSE)+VLOOKUP($L23,#REF!,4,FALSE))=TRUE,\"\",VLOOKUP($L23,'All Individuals Day 1 (ALL)'!$C$3:$G$277,4,FALSE)+VLOOKUP($L23,#REF!,4,FALSE))","v":{"$error":"#REF!"}},{"$f":"IF(ISNA(VLOOKUP($L23,'All Individuals Day 1 (ALL)'!$C$3:$G$277,5,FALSE)+VLOOKUP($L23,#REF!,5,FALSE))=TRUE,\"\",VLOOKUP($L23,'All Individuals Day 1 (ALL)'!$C$3:$G$277,5,FALSE)+VLOOKUP($L23,#REF!,5,FALSE))","v":{"$error":"#REF!"}},{"$f":"IF(ISNA(VLOOKUP($L23,'All Individuals Day 1 (ALL)'!$C$3:$K$277,8,FALSE))=TRUE,\"\",VLOOKUP($L23,'All Individuals Day 1 (ALL)'!$C$3:$K$277,8,FALSE))","v":2},{"$f":"IF(ISNA(VLOOKUP($L23,#REF!,8,FALSE))=TRUE,\"\",VLOOKUP($L23,#REF!,8,FALSE))","v":{"$error":"#REF!"}},{"$error":"#REF!"}]
[{"$f":"VLOOKUP($B24,#REF!,2,FALSE)","v":{"$error":"#N/A"}},{"$error":"#N/A"},{"$error":"#N/A"},{"$error":"#N/A"},{"$error":"#N/A"},{"$error":"#N/A"},{"$error":"#N/A"},21,null,null,{"$error":"#REF!"},21,{"$f":"IF(ISNA(VLOOKUP($L24,'All Individuals Day 1 (ALL)'!$C$3:$G$277,4,FALSE)+VLOOKUP($L24,#REF!,4,FALSE))=TRUE,\"\",VLOOKUP($L24,'All Individuals Day 1 (ALL)'!$C$3:$G$277,4,FALSE)+VLOOKUP($L24,#REF!,4,FALSE))","v":{"$error":"#REF!"}},{"$f":"IF(ISNA(VLOOKUP($L24,'All Individuals Day 1 (ALL)'!$C$3:$G$277,5,FALSE)+VLOOKUP($L24,#REF!,5,FALSE))=TRUE,\"\",VLOOKUP($L24,'All Individuals Day 1 (ALL)'!$C$3:$G$277,5,FALSE)+VLOOKUP($L24,#REF!,5,FALSE))","v":{"$error":"#REF!"}},{"$f":"IF(ISNA(VLOOKUP($L24,'All Individuals Day 1 (ALL)'!$C$3:$K$277,8,FALSE))=TRUE,\"\",VLOOKUP($L24,'All Individuals Day 1 (ALL)'!$C$3:$K$277,8,FALSE))","v":4},{"$f":"IF(ISNA(VLOOKUP($L24,#REF!,8,FALSE))=TRUE,\"\",VLOOKUP($L24,#REF!,8,FALSE))","v":{"$error":"#REF!"}},{"$error":"#REF!"}]
[{"$f":"VLOOKUP($B25,#REF!,2,FALSE)","v":{"$error":"#N/A"}},{"$error":"#N/A"},{"$error":"#N/A"},{"$error":"#N/A"},{"$error":"#N/A"},{"$error":"#N/A"},{"$error":"#N/A"},22,null,null,{"$error":"#REF!"},22,{"$f":"IF(ISNA(VLOOKUP($L25,'All Individuals Day 1 (ALL)'!$C$3:$G$277,4,FALSE)+VLOOKUP($L25,#REF!,4,FALSE))=TRUE,\"\",VLOOKUP($L25,'All Individuals Day 1 (ALL)'!$C$3:$G$277,4,FALSE)+VLOOKUP($L25,#REF!,4,FALSE))","v":{"$error":"#REF!"}},{"$f":"IF(ISNA(VLOOKUP($L25,'All Individuals Day 1 (ALL)'!$C$3:$G$277,5,FALSE)+VLOOKUP($L25,#REF!,5,FALSE))=TRUE,\"\",VLOOKUP($L25,'All Individuals Day 1 (ALL)'!$C$3:$G$277,5,FALSE)+VLOOKUP($L25,#REF!,5,FALSE))","v":{"$error":"#REF!"}},{"$f":"IF(ISNA(VLOOKUP($L25,'All Individuals Day 1 (ALL)'!$C$3:$K$277,8,FALSE))=TRUE,\"\",VLOOKUP($L25,'All Individuals Day 1 (ALL)'!$C$3:$K$277,8,FALSE))","v":5},{"$f":"IF(ISNA(VLOOKUP($L25,#REF!,8,FALSE))=TRUE,\"\",VLOOKUP($L25,#REF!,8,FALSE))","v":{"$error":"#REF!"}},{"$error":"#REF!"}]
[{"$f":"VLOOKUP($B26,#REF!,2,FALSE)","v":{"$error":"#N/A"}},{"$error":"#N/A"},{"$error":"#N/A"},{"$error":"#N/A"},{"$error":"#N/A"},{"$error":"#N/A"},{"$error":"#N/A"},23,null,null,{"$error":"#REF!"},23,{"$f":"IF(ISNA(VLOOKUP($L26,'All Individuals Day 1 (ALL)'!$C$3:$G$277,4,FALSE)+VLOOKUP($L26,#REF!,4,FALSE))=TRUE,\"\",VLOOKUP($L26,'All Individuals Day 1 (ALL)'!$C$3:$G$277,4,FALSE)+VLOOKUP($L26,#REF!,4,FALSE))","v":{"$error":"#REF!"}},{"$f":"IF(ISNA(VLOOKUP($L26,'All Individuals Day 1 (ALL)'!$C$3:$G$277,5,FALSE)+VLOOKUP($L26,#REF!,5,FALSE))=TRUE,\"\",VLOOKUP($L26,'All Individuals Day 1 (ALL)'!$C$3:$G$277,5,FALSE)+VLOOKUP($L26,#REF!,5,FALSE))","v":{"$error":"#REF!"}},{"$f":"IF(ISNA(VLOOKUP($L26,'All Individuals Day 1 (ALL)'!$C$3:$K$277,8,FALSE))=TRUE,\"\",VLOOKUP($L26,'All Individuals Day 1 (ALL)'!$C$3:$K$277,8,FALSE))","v":9},{"$f":"IF(ISNA(VLOOKUP($L26,#REF!,8,FALSE))=TRUE,\"\",VLOOKUP($L26,#REF!,8,FALSE))","v":{"$error":"#REF!"}},{"$error":"#REF!"}]
[{"$f":"VLOOKUP($B27,#REF!,2,FALSE)","v":{"$error":"#N/A"}},{"$error":"#N/A"},{"$error":"#N/A"},{"$error":"#N/A"},{"$error":"#N/A"},{"$error":"#N/A"},{"$error":"#N/A"},24,null,null,{"$error":"#REF!"},24,{"$f":"IF(ISNA(VLOOKUP($L27,'All Individuals Day 1 (ALL)'!$C$3:$G$277,4,FALSE)+VLOOKUP($L27,#REF!,4,FALSE))=TRUE,\"\",VLOOKUP($L27,'All Individuals Day 1 (ALL)'!$C$3:$G$277,4,FALSE)+VLOOKUP($L27,#REF!,4,FALSE))","v":{"$error":"#REF!"}},{"$f":"IF(ISNA(VLOOKUP($L27,'All Individuals Day 1 (ALL)'!$C$3:$G$277,5,FALSE)+VLOOKUP($L27,#REF!,5,FALSE))=TRUE,\"\",VLOOKUP($L27,'All Individuals Day 1 (ALL)'!$C$3:$G$277,5,FALSE)+VLOOKUP($L27,#REF!,5,FALSE))","v":{"$error":"#REF!"}},{"$f":"IF(ISNA(VLOOKUP($L27,'All Individuals Day 1 (ALL)'!$C$3:$K$277,8,FALSE))=TRUE,\"\",VLOOKUP($L27,'All Individuals Day 1 (ALL)'!$C$3:$K$277,8,FALSE))","v":7},{"$f":"IF(ISNA(VLOOKUP($L27,#REF!,8,FALSE))=TRUE,\"\",VLOOKUP($L27,#REF!,8,FALSE))","v":{"$error":"#REF!"}},{"$error":"#REF!"}]
[{"$f":"VLOOKUP($B28,#REF!,2,FALSE)","v":{"$error":"#N/A"}},{"$error":"#N/A"},{"$error":"#N/A"},{"$error":"#N/A"},{"$error":"#N/A"},{"$error":"#N/A"},{"$error":"#N/A"},25,null,null,{"$error":"#REF!"},25,{"$f":"IF(ISNA(VLOOKUP($L28,'All Individuals Day 1 (ALL)'!$C$3:$G$277,4,FALSE)+VLOOKUP($L28,#REF!,4,FALSE))=TRUE,\"\",VLOOKUP($L28,'All Individuals Day 1 (ALL)'!$C$3:$G$277,4,FALSE)+VLOOKUP($L28,#REF!,4,FALSE))","v":{"$error":"#REF!"}},{"$f":"IF(ISNA(VLOOKUP($L28,'All Individuals Day 1 (ALL)'!$C$3:$G$277,5,FALSE)+VLOOKUP($L28,#REF!,5,FALSE))=TRUE,\"\",VLOOKUP($L28,'All Individuals Day 1 (ALL)'!$C$3:$G$277,5,FALSE)+VLOOKUP($L28,#REF!,5,FALSE))","v":{"$error":"#REF!"}},{"$f":"IF(ISNA(VLOOKUP($L28,'All Individuals Day 1 (ALL)'!$C$3:$K$277,8,FALSE))=TRUE,\"\",VLOOKUP($L28,'All Individuals Day 1 (ALL)'!$C$3:$K$277,8,FALSE))","v":15},{"$f":"IF(ISNA(VLOOKUP($L28,#REF!,8,FALSE))=TRUE,\"\",VLOOKUP($L28,#REF!,8,FALSE))","v":{"$error":"#REF!"}},{"$error":"#REF!"}]
[{"$f":"VLOOKUP($B29,#REF!,2,FALSE)","v":{"$error":"#N/A"}},{"$error":"#N/A"},{"$error":"#N/A"},{"$error":"#N/A"},{"$error":"#N/A"},{"$error":"#N/A"},{"$error":"#N/A"},26,null,null,{"$error":"#REF!"},26,{"$f":"IF(ISNA(VLOOKUP($L29,'All Individuals Day 1 (ALL)'!$C$3:$G$277,4,FALSE)+VLOOKUP($L29,#REF!,4,FALSE))=TRUE,\"\",VLOOKUP($L29,'All Individuals Day 1 (ALL)'!$C$3:$G$277,4,FALSE)+VLOOKUP($L29,#REF!,4,FALSE))","v":{"$error":"#REF!"}},{"$f":"IF(ISNA(VLOOKUP($L29,'All Individuals Day 1 (ALL)'!$C$3:$G$277,5,FALSE)+VLOOKUP($L29,#REF!,5,FALSE))=TRUE,\"\",VLOOKUP($L29,'All Individuals Day 1 (ALL)'!$C$3:$G$277,5,FALSE)+VLOOKUP($L29,#REF!,5,FALSE))","v":{"$error":"#REF!"}},{"$f":"IF(ISNA(VLOOKUP($L29,'All Individuals Day 1 (ALL)'!$C$3:$K$277,8,FALSE))=TRUE,\"\",VLOOKUP($L29,'All Individuals Day 1 (ALL)'!$C$3:$K$277,8,FALSE))","v":6},{"$f":"IF(ISNA(VLOOKUP($L29,#REF!,8,FALSE))=TRUE,\"\",VLOOKUP($L29,#REF!,8,FALSE))","v":{"$error":"#REF!"}},{"$error":"#REF!"}]
[{"$f":"VLOOKUP($B30,#REF!,2,FALSE)","v":{"$error":"#N/A"}},{"$error":"#N/A"},{"$error":"#N/A"},{"$error":"#N/A"},{"$error":"#N/A"},{"$error":"#N/A"},{"$error":"#N/A"},27,null,null,{"$error":"#REF!"},27,{"$f":"IF(ISNA(VLOOKUP($L30,'All Individuals Day 1 (ALL)'!$C$3:$G$277,4,FALSE)+VLOOKUP($L30,#REF!,4,FALSE))=TRUE,\"\",VLOOKUP($L30,'All Individuals Day 1 (ALL)'!$C$3:$G$277,4,FALSE)+VLOOKUP($L30,#REF!,4,FALSE))","v":{"$error":"#REF!"}},{"$f":"IF(ISNA(VLOOKUP($L30,'All Individuals Day 1 (ALL)'!$C$3:$G$277,5,FALSE)+VLOOKUP($L30,#REF!,5,FALSE))=TRUE,\"\",VLOOKUP($L30,'All Individuals Day 1 (ALL)'!$C$3:$G$277,5,FALSE)+VLOOKUP($L30,#REF!,5,FALSE))","v":{"$error":"#REF!"}},{"$f":"IF(ISNA(VLOOKUP($L30,'All Individuals Day 1 (ALL)'!$C$3:$K$277,8,FALSE))=TRUE,\"\",VLOOKUP($L30,'All Individuals Day 1 (ALL)'!$C$3:$K$277,8,FALSE))","v":13},{"$f":"IF(ISNA(VLOOKUP($L30,#REF!,8,FALSE))=TRUE,\"\",VLOOKUP($L30,#REF!,8,FALSE))","v":{"$error":"#REF!"}},{"$error":"#REF!"}]
[{"$f":"VLOOKUP($B31,#REF!,2,FALSE)","v":{"$error":"#N/A"}},{"$error":"#N/A"},{"$error":"#N/A"},{"$error":"#N/A"},{"$error":"#N/A"},{"$error":"#N/A"},{"$error":"#N/A"},28,null,null,{"$error":"#REF!"},28,{"$f":"IF(ISNA(VLOOKUP($L31,'All Individuals Day 1 (ALL)'!$C$3:$G$277,4,FALSE)+VLOOKUP($L31,#REF!,4,FALSE))=TRUE,\"\",VLOOKUP($L31,'All Individuals Day 1 (ALL)'!$C$3:$G$277,4,FALSE)+VLOOKUP($L31,#REF!,4,FALSE))","v":{"$error":"#REF!"}},{"$f":"IF(ISNA(VLOOKUP($L31,'All Individuals Day 1 (ALL)'!$C$3:$G$277,5,FALSE)+VLOOKUP($L31,#REF!,5,FALSE))=TRUE,\"\",VLOOKUP($L31,'All Individuals Day 1 (ALL)'!$C$3:$G$277,5,FALSE)+VLOOKUP($L31,#REF!,5,FALSE))","v":{"$error":"#REF!"}},{"$f":"IF(ISNA(VLOOKUP($L31,'All Individuals Day 1 (ALL)'!$C$3:$K$277,8,FALSE))=TRUE,\"\",VLOOKUP($L31,'All Individuals Day 1 (ALL)'!$C$3:$K$277,8,FALSE))","v":4},{"$f":"IF(ISNA(VLOOKUP($L31,#REF!,8,FALSE))=TRUE,\"\",VLOOKUP($L31,#REF!,8,FALSE))","v":{"$error":"#REF!"}},{"$error":"#REF!"}]
[{"$f":"VLOOKUP($B32,#REF!,2,FALSE)","v":{"$error":"#N/A"}},{"$error":"#N/A"},{"$error":"#N/A"},{"$error":"#N/A"},{"$error":"#N/A"},{"$error":"#N/A"},{"$error":"#N/A"},29,null,null,{"$error":"#REF!"},29,{"$f":"IF(ISNA(VLOOKUP($L32,'All Individuals Day 1 (ALL)'!$C$3:$G$277,4,FALSE)+VLOOKUP($L32,#REF!,4,FALSE))=TRUE,\"\",VLOOKUP($L32,'All Individuals Day 1 (ALL)'!$C$3:$G$277,4,FALSE)+VLOOKUP($L32,#REF!,4,FALSE))","v":{"$error":"#REF!"}},{"$f":"IF(ISNA(VLOOKUP($L32,'All Individuals Day 1 (ALL)'!$C$3:$G$277,5,FALSE)+VLOOKUP($L32,#REF!,5,FALSE))=TRUE,\"\",VLOOKUP($L32,'All Individuals Day 1 (ALL)'!$C$3:$G$277,5,FALSE)+VLOOKUP($L32,#REF!,5,FALSE))","v":{"$error":"#REF!"}},{"$f":"IF(ISNA(VLOOKUP($L32,'All Individuals Day 1 (ALL)'!$C$3:$K$277,8,FALSE))=TRUE,\"\",VLOOKUP($L32,'All Individuals Day 1 (ALL)'!$C$3:$K$277,8,FALSE))","v":1},{"$f":"IF(ISNA(VLOOKUP($L32,#REF!,8,FALSE))=TRUE,\"\",VLOOKUP($L32,#REF!,8,FALSE))","v":{"$error":"#REF!"}},{"$error":"#REF!"}]
[{"$f":"VLOOKUP($B33,#REF!,2,FALSE)","v":{"$error":"#N/A"}},{"$error":"#N/A"},{"$error":"#N/A"},{"$error":"#N/A"},{"$error":"#N/A"},{"$error":"#N/A"},{"$error":"#N/A"},30,null,null,{"$error":"#REF!"},30,{"$f":"IF(ISNA(VLOOKUP($L33,'All Individuals Day 1 (ALL)'!$C$3:$G$277,4,FALSE)+VLOOKUP($L33,#REF!,4,FALSE))=TRUE,\"\",VLOOKUP($L33,'All Individuals Day 1 (ALL)'!$C$3:$G$277,4,FALSE)+VLOOKUP($L33,#REF!,4,FALSE))","v":{"$error":"#REF!"}},{"$f":"IF(ISNA(VLOOKUP($L33,'All Individuals Day 1 (ALL)'!$C$3:$G$277,5,FALSE)+VLOOKUP($L33,#REF!,5,FALSE))=TRUE,\"\",VLOOKUP($L33,'All Individuals Day 1 (ALL)'!$C$3:$G$277,5,FALSE)+VLOOKUP($L33,#REF!,5,FALSE))","v":{"$error":"#REF!"}},{"$f":"IF(ISNA(VLOOKUP($L33,'All Individuals Day 1 (ALL)'!$C$3:$K$277,8,FALSE))=TRUE,\"\",VLOOKUP($L33,'All Individuals Day 1 (ALL)'!$C$3:$K$277,8,FALSE))","v":8},{"$f":"IF(ISNA(VLOOKUP($L33,#REF!,8,FALSE))=TRUE,\"\",VLOOKUP($L33,#REF!,8,FALSE))","v":{"$error":"#REF!"}},{"$error":"#REF!"}]
[{"$f":"VLOOKUP($B34,#REF!,2,FALSE)","v":{"$error":"#N/A"}},{"$error":"#N/A"},{"$error":"#N/A"},{"$error":"#N/A"},{"$error":"#N/A"},{"$error":"#N/A"},{"$error":"#N/A"},31,null,null,{"$error":"#REF!"},31,{"$f":"IF(ISNA(VLOOKUP($L34,'All Individuals Day 1 (ALL)'!$C$3:$G$277,4,FALSE)+VLOOKUP($L34,#REF!,4,FALSE))=TRUE,\"\",VLOOKUP($L34,'All Individuals Day 1 (ALL)'!$C$3:$G$277,4,FALSE)+VLOOKUP($L34,#REF!,4,FALSE))","v":{"$error":"#REF!"}},{"$f":"IF(ISNA(VLOOKUP($L34,'All Individuals Day 1 (ALL)'!$C$3:$G$277,5,FALSE)+VLOOKUP($L34,#REF!,5,FALSE))=TRUE,\"\",VLOOKUP($L34,'All Individuals Day 1 (ALL)'!$C$3:$G$277,5,FALSE)+VLOOKUP($L34,#REF!,5,FALSE))","v":{"$error":"#REF!"}},{"$f":"IF(ISNA(VLOOKUP($L34,'All Individuals Day 1 (ALL)'!$C$3:$K$277,8,FALSE))=TRUE,\"\",VLOOKUP($L34,'All Individuals Day 1 (ALL)'!$C$3:$K$277,8,FALSE))","v":10},{"$f":"IF(ISNA(VLOOKUP($L34,#REF!,8,FALSE))=TRUE,\"\",VLOOKUP($L34,#REF!,8,FALSE))","v":{"$error":"#REF!"}},{"$error":"#REF!"}]
[{"$f":"VLOOKUP($B35,#REF!,2,FALSE)","v":{"$error":"#N/A"}},{"$error":"#N/A"},{"$error":"#N/A"},{"$error":"#N/A"},{"$error":"#N/A"},{"$error":"#N/A"},{"$error":"#N/A"},32,null,null,{"$error":"#REF!"},32,{"$f":"IF(ISNA(VLOOKUP($L35,'All Individuals Day 1 (ALL)'!$C$3:$G$277,4,FALSE)+VLOOKUP($L35,#REF!,4,FALSE))=TRUE,\"\",VLOOKUP($L35,'All Individuals Day 1 (ALL)'!$C$3:$G$277,4,FALSE)+VLOOKUP($L35,#REF!,4,FALSE))","v":{"$error":"#REF!"}},{"$f":"IF(ISNA(VLOOKUP($L35,'All Individuals Day 1 (ALL)'!$C$3:$G$277,5,FALSE)+VLOOKUP($L35,#REF!,5,FALSE))=TRUE,\"\",VLOOKUP($L35,'All Individuals Day 1 (ALL)'!$C$3:$G$277,5,FALSE)+VLOOKUP($L35,#REF!,5,FALSE))","v":{"$error":"#REF!"}},{"$f":"IF(ISNA(VLOOKUP($L35,'All Individuals Day 1 (ALL)'!$C$3:$K$277,8,FALSE))=TRUE,\"\",VLOOKUP($L35,'All Individuals Day 1 (ALL)'!$C$3:$K$277,8,FALSE))","v":2},{"$f":"IF(ISNA(VLOOKUP($L35,#REF!,8,FALSE))=TRUE,\"\",VLOOKUP($L35,#REF!,8,FALSE))","v":{"$error":"#REF!"}},{"$error":"#REF!"}]
[{"$f":"VLOOKUP($B36,#REF!,2,FALSE)","v":{"$error":"#N/A"}},{"$f":"VLOOKUP($H36,$K$4:$Q$300,2,FALSE)","v":{"$error":"#N/A"}},{"$f":"VLOOKUP($H36,$K$4:$Q$300,3,FALSE)","v":{"$error":"#N/A"}},{"$f":"VLOOKUP($H36,$K$4:$Q$300,4,FALSE)","v":{"$error":"#N/A"}},{"$f":"VLOOKUP($H36,$K$4:$Q$300,5,FALSE)","v":{"$error":"#N/A"}},{"$f":"VLOOKUP($H36,$K$4:$Q$300,6,FALSE)","v":{"$error":"#N/A"}},{"$f":"VLOOKUP($H36,$K$4:$Q$300,7,FALSE)","v":{"$error":"#N/A"}},33,null,null,{"$f":"IF(Q36=NpZ*NoZ*2,NpZ*NoZ,RANK(Q36,Q$4:Q$300,1))","v":{"$error":"#REF!"}},33,{"$f":"IF(ISNA(VLOOKUP($L36,'All Individuals Day 1 (ALL)'!$C$3:$G$277,4,FALSE)+VLOOKUP($L36,#REF!,4,FALSE))=TRUE,\"\",VLOOKUP($L36,'All Individuals Day 1 (ALL)'!$C$3:$G$277,4,FALSE)+VLOOKUP($L36,#REF!,4,FALSE))","v":{"$error":"#REF!"}},{"$f":"IF(ISNA(VLOOKUP($L36,'All Individuals Day 1 (ALL)'!$C$3:$G$277,5,FALSE)+VLOOKUP($L36,#REF!,5,FALSE))=TRUE,\"\",VLOOKUP($L36,'All Individuals Day 1 (ALL)'!$C$3:$G$277,5,FALSE)+VLOOKUP($L36,#REF!,5,FALSE))","v":{"$error":"#REF!"}},{"$f":"IF(ISNA(VLOOKUP($L36,'All Individuals Day 1 (ALL)'!$C$3:$K$277,8,FALSE))=TRUE,\"\",VLOOKUP($L36,'All Individuals Day 1 (ALL)'!$C$3:$K$277,8,FALSE))","v":10},{"$f":"IF(ISNA(VLOOKUP($L36,#REF!,8,FALSE))=TRUE,\"\",VLOOKUP($L36,#REF!,8,FALSE))","v":{"$error":"#REF!"}},{"$f":"IF(OR(M36=\"\",M36=0),NpZ*2,(O36+P36)-N36/100000-M36/1000000)","v":{"$error":"#REF!"}}]
[{"$f":"VLOOKUP($B37,#REF!,2,FALSE)","v":{"$error":"#N/A"}},{"$error":"#N/A"},{"$error":"#N/A"},{"$error":"#N/A"},{"$error":"#N/A"},{"$error":"#N/A"},{"$error":"#N/A"},34,null,null,{"$error":"#REF!"},34,{"$f":"IF(ISNA(VLOOKUP($L37,'All Individuals Day 1 (ALL)'!$C$3:$G$277,4,FALSE)+VLOOKUP($L37,#REF!,4,FALSE))=TRUE,\"\",VLOOKUP($L37,'All Individuals Day 1 (ALL)'!$C$3:$G$277,4,FALSE)+VLOOKUP($L37,#REF!,4,FALSE))","v":{"$error":"#REF!"}},{"$f":"IF(ISNA(VLOOKUP($L37,'All Individuals Day 1 (ALL)'!$C$3:$G$277,5,FALSE)+VLOOKUP($L37,#REF!,5,FALSE))=TRUE,\"\",VLOOKUP($L37,'All Individuals Day 1 (ALL)'!$C$3:$G$277,5,FALSE)+VLOOKUP($L37,#REF!,5,FALSE))","v":{"$error":"#REF!"}},{"$f":"IF(ISNA(VLOOKUP($L37,'All Individuals Day 1 (ALL)'!$C$3:$K$277,8,FALSE))=TRUE,\"\",VLOOKUP($L37,'All Individuals Day 1 (ALL)'!$C$3:$K$277,8,FALSE))","v":14},{"$f":"IF(ISNA(VLOOKUP($L37,#REF!,8,FALSE))=TRUE,\"\",VLOOKUP($L37,#REF!,8,FALSE))","v":{"$error":"#REF!"}},{"$error":"#REF!"}]
[{"$f":"VLOOKUP($B38,#REF!,2,FALSE)","v":{"$error":"#N/A"}},{"$error":"#N/A"},{"$error":"#N/A"},{"$error":"#N/A"},{"$error":"#N/A"},{"$error":"#N/A"},{"$error":"#N/A"},35,null,null,{"$error":"#REF!"},35,{"$f":"IF(ISNA(VLOOKUP($L38,'All Individuals Day 1 (ALL)'!$C$3:$G$277,4,FALSE)+VLOOKUP($L38,#REF!,4,FALSE))=TRUE,\"\",VLOOKUP($L38,'All Individuals Day 1 (ALL)'!$C$3:$G$277,4,FALSE)+VLOOKUP($L38,#REF!,4,FALSE))","v":{"$error":"#REF!"}},{"$f":"IF(ISNA(VLOOKUP($L38,'All Individuals Day 1 (ALL)'!$C$3:$G$277,5,FALSE)+VLOOKUP($L38,#REF!,5,FALSE))=TRUE,\"\",VLOOKUP($L38,'All Individuals Day 1 (ALL)'!$C$3:$G$277,5,FALSE)+VLOOKUP($L38,#REF!,5,FALSE))","v":{"$error":"#REF!"}},{"$f":"IF(ISNA(VLOOKUP($L38,'All Individuals Day 1 (ALL)'!$C$3:$K$277,8,FALSE))=TRUE,\"\",VLOOKUP($L38,'All Individuals Day 1 (ALL)'!$C$3:$K$277,8,FALSE))","v":2},{"$f":"IF(ISNA(VLOOKUP($L38,#REF!,8,FALSE))=TRUE,\"\",VLOOKUP($L38,#REF!,8,FALSE))","v":{"$error":"#REF!"}},{"$error":"#REF!"}]
[{"$f":"VLOOKUP($B39,#REF!,2,FALSE)","v":{"$error":"#N/A"}},{"$error":"#N/A"},{"$error":"#N/A"},{"$error":"#N/A"},{"$error":"#N/A"},{"$error":"#N/A"},{"$error":"#N/A"},36,null,null,{"$error":"#REF!"},36,{"$f":"IF(ISNA(VLOOKUP($L39,'All Individuals Day 1 (ALL)'!$C$3:$G$277,4,FALSE)+VLOOKUP($L39,#REF!,4,FALSE))=TRUE,\"\",VLOOKUP($L39,'All Individuals Day 1 (ALL)'!$C$3:$G$277,4,FALSE)+VLOOKUP($L39,#REF!,4,FALSE))","v":{"$error":"#REF!"}},{"$f":"IF(ISNA(VLOOKUP($L39,'All Individuals Day 1 (ALL)'!$C$3:$G$277,5,FALSE)+VLOOKUP($L39,#REF!,5,FALSE))=TRUE,\"\",VLOOKUP($L39,'All Individuals Day 1 (ALL)'!$C$3:$G$277,5,FALSE)+VLOOKUP($L39,#REF!,5,FALSE))","v":{"$error":"#REF!"}},{"$f":"IF(ISNA(VLOOKUP($L39,'All Individuals Day 1 (ALL)'!$C$3:$K$277,8,FALSE))=TRUE,\"\",VLOOKUP($L39,'All Individuals Day 1 (ALL)'!$C$3:$K$277,8,FALSE))","v":3},{"$f":"IF(ISNA(VLOOKUP($L39,#REF!,8,FALSE))=TRUE,\"\",VLOOKUP($L39,#REF!,8,FALSE))","v":{"$error":"#REF!"}},{"$error":"#REF!"}]
[{"$f":"VLOOKUP($B40,#REF!,2,FALSE)","v":{"$error":"#N/A"}},{"$error":"#N/A"},{"$error":"#N/A"},{"$error":"#N/A"},{"$error":"#N/A"},{"$error":"#N/A"},{"$error":"#N/A"},37,null,null,{"$error":"#REF!"},37,{"$f":"IF(ISNA(VLOOKUP($L40,'All Individuals Day 1 (ALL)'!$C$3:$G$277,4,FALSE)+VLOOKUP($L40,#REF!,4,FALSE))=TRUE,\"\",VLOOKUP($L40,'All Individuals Day 1 (ALL)'!$C$3:$G$277,4,FALSE)+VLOOKUP($L40,#REF!,4,FALSE))","v":{"$error":"#REF!"}},{"$f":"IF(ISNA(VLOOKUP($L40,'All Individuals Day 1 (ALL)'!$C$3:$G$277,5,FALSE)+VLOOKUP($L40,#REF!,5,FALSE))=TRUE,\"\",VLOOKUP($L40,'All Individuals Day 1 (ALL)'!$C$3:$G$277,5,FALSE)+VLOOKUP($L40,#REF!,5,FALSE))","v":{"$error":"#REF!"}},{"$f":"IF(ISNA(VLOOKUP($L40,'All Individuals Day 1 (ALL)'!$C$3:$K$277,8,FALSE))=TRUE,\"\",VLOOKUP($L40,'All Individuals Day 1 (ALL)'!$C$3:$K$277,8,FALSE))","v":4},{"$f":"IF(ISNA(VLOOKUP($L40,#REF!,8,FALSE))=TRUE,\"\",VLOOKUP($L40,#REF!,8,FALSE))","v":{"$error":"#REF!"}},{"$error":"#REF!"}]
[{"$f":"VLOOKUP($B41,#REF!,2,FALSE)","v":{"$error":"#N/A"}},{"$error":"#N/A"},{"$error":"#N/A"},{"$error":"#N/A"},{"$error":"#N/A"},{"$error":"#N/A"},{"$error":"#N/A"},38,null,null,{"$error":"#REF!"},38,{"$f":"IF(ISNA(VLOOKUP($L41,'All Individuals Day 1 (ALL)'!$C$3:$G$277,4,FALSE)+VLOOKUP($L41,#REF!,4,FALSE))=TRUE,\"\",VLOOKUP($L41,'All Individuals Day 1 (ALL)'!$C$3:$G$277,4,FALSE)+VLOOKUP($L41,#REF!,4,FALSE))","v":{"$error":"#REF!"}},{"$f":"IF(ISNA(VLOOKUP($L41,'All Individuals Day 1 (ALL)'!$C$3:$G$277,5,FALSE)+VLOOKUP($L41,#REF!,5,FALSE))=TRUE,\"\",VLOOKUP($L41,'All Individuals Day 1 (ALL)'!$C$3:$G$277,5,FALSE)+VLOOKUP($L41,#REF!,5,FALSE))","v":{"$error":"#REF!"}},{"$f":"IF(ISNA(VLOOKUP($L41,'All Individuals Day 1 (ALL)'!$C$3:$K$277,8,FALSE))=TRUE,\"\",VLOOKUP($L41,'All Individuals Day 1 (ALL)'!$C$3:$K$277,8,FALSE))","v":4},{"$f":"IF(ISNA(VLOOKUP($L41,#REF!,8,FALSE))=TRUE,\"\",VLOOKUP($L41,#REF!,8,FALSE))","v":{"$error":"#REF!"}},{"$error":"#REF!"}]
[{"$f":"VLOOKUP($B42,#REF!,2,FALSE)","v":{"$error":"#N/A"}},{"$error":"#N/A"},{"$error":"#N/A"},{"$error":"#N/A"},{"$error":"#N/A"},{"$error":"#N/A"},{"$error":"#N/A"},39,null,null,{"$error":"#REF!"},39,{"$f":"IF(ISNA(VLOOKUP($L42,'All Individuals Day 1 (ALL)'!$C$3:$G$277,4,FALSE)+VLOOKUP($L42,#REF!,4,FALSE))=TRUE,\"\",VLOOKUP($L42,'All Individuals Day 1 (ALL)'!$C$3:$G$277,4,FALSE)+VLOOKUP($L42,#REF!,4,FALSE))","v":{"$error":"#REF!"}},{"$f":"IF(ISNA(VLOOKUP($L42,'All Individuals Day 1 (ALL)'!$C$3:$G$277,5,FALSE)+VLOOKUP($L42,#REF!,5,FALSE))=TRUE,\"\",VLOOKUP($L42,'All Individuals Day 1 (ALL)'!$C$3:$G$277,5,FALSE)+VLOOKUP($L42,#REF!,5,FALSE))","v":{"$error":"#REF!"}},{"$f":"IF(ISNA(VLOOKUP($L42,'All Individuals Day 1 (ALL)'!$C$3:$K$277,8,FALSE))=TRUE,\"\",VLOOKUP($L42,'All Individuals Day 1 (ALL)'!$C$3:$K$277,8,FALSE))","v":1},{"$f":"IF(ISNA(VLOOKUP($L42,#REF!,8,FALSE))=TRUE,\"\",VLOOKUP($L42,#REF!,8,FALSE))","v":{"$error":"#REF!"}},{"$error":"#REF!"}]
[{"$f":"VLOOKUP($B43,#REF!,2,FALSE)","v":{"$error":"#N/A"}},{"$error":"#N/A"},{"$error":"#N/A"},{"$error":"#N/A"},{"$error":"#N/A"},{"$error":"#N/A"},{"$error":"#N/A"},40,null,null,{"$error":"#REF!"},40,{"$f":"IF(ISNA(VLOOKUP($L43,'All Individuals Day 1 (ALL)'!$C$3:$G$277,4,FALSE)+VLOOKUP($L43,#REF!,4,FALSE))=TRUE,\"\",VLOOKUP($L43,'All Individuals Day 1 (ALL)'!$C$3:$G$277,4,FALSE)+VLOOKUP($L43,#REF!,4,FALSE))","v":{"$error":"#REF!"}},{"$f":"IF(ISNA(VLOOKUP($L43,'All Individuals Day 1 (ALL)'!$C$3:$G$277,5,FALSE)+VLOOKUP($L43,#REF!,5,FALSE))=TRUE,\"\",VLOOKUP($L43,'All Individuals Day 1 (ALL)'!$C$3:$G$277,5,FALSE)+VLOOKUP($L43,#REF!,5,FALSE))","v":{"$error":"#REF!"}},{"$f":"IF(ISNA(VLOOKUP($L43,'All Individuals Day 1 (ALL)'!$C$3:$K$277,8,FALSE))=TRUE,\"\",VLOOKUP($L43,'All Individuals Day 1 (ALL)'!$C$3:$K$277,8,FALSE))","v":7},{"$f":"IF(ISNA(VLOOKUP($L43,#REF!,8,FALSE))=TRUE,\"\",VLOOKUP($L43,#REF!,8,FALSE))","v":{"$error":"#REF!"}},{"$error":"#REF!"}]
[{"$f":"VLOOKUP($B44,#REF!,2,FALSE)","v":{"$error":"#N/A"}},{"$error":"#N/A"},{"$error":"#N/A"},{"$error":"#N/A"},{"$error":"#N/A"},{"$error":"#N/A"},{"$error":"#N/A"},41,null,null,{"$error":"#REF!"},41,{"$f":"IF(ISNA(VLOOKUP($L44,'All Individuals Day 1 (ALL)'!$C$3:$G$277,4,FALSE)+VLOOKUP($L44,#REF!,4,FALSE))=TRUE,\"\",VLOOKUP($L44,'All Individuals Day 1 (ALL)'!$C$3:$G$277,4,FALSE)+VLOOKUP($L44,#REF!,4,FALSE))","v":{"$error":"#REF!"}},{"$f":"IF(ISNA(VLOOKUP($L44,'All Individuals Day 1 (ALL)'!$C$3:$G$277,5,FALSE)+VLOOKUP($L44,#REF!,5,FALSE))=TRUE,\"\",VLOOKUP($L44,'All Individuals Day 1 (ALL)'!$C$3:$G$277,5,FALSE)+VLOOKUP($L44,#REF!,5,FALSE))","v":{"$error":"#REF!"}},{"$f":"IF(ISNA(VLOOKUP($L44,'All Individuals Day 1 (ALL)'!$C$3:$K$277,8,FALSE))=TRUE,\"\",VLOOKUP($L44,'All Individuals Day 1 (ALL)'!$C$3:$K$277,8,FALSE))","v":16},{"$f":"IF(ISNA(VLOOKUP($L44,#REF!,8,FALSE))=TRUE,\"\",VLOOKUP($L44,#REF!,8,FALSE))","v":{"$error":"#REF!"}},{"$error":"#REF!"}]
[{"$f":"VLOOKUP($B45,#REF!,2,FALSE)","v":{"$error":"#N/A"}},{"$error":"#N/A"},{"$error":"#N/A"},{"$error":"#N/A"},{"$error":"#N/A"},{"$error":"#N/A"},{"$error":"#N/A"},42,null,null,{"$error":"#REF!"},42,{"$f":"IF(ISNA(VLOOKUP($L45,'All Individuals Day 1 (ALL)'!$C$3:$G$277,4,FALSE)+VLOOKUP($L45,#REF!,4,FALSE))=TRUE,\"\",VLOOKUP($L45,'All Individuals Day 1 (ALL)'!$C$3:$G$277,4,FALSE)+VLOOKUP($L45,#REF!,4,FALSE))","v":{"$error":"#REF!"}},{"$f":"IF(ISNA(VLOOKUP($L45,'All Individuals Day 1 (ALL)'!$C$3:$G$277,5,FALSE)+VLOOKUP($L45,#REF!,5,FALSE))=TRUE,\"\",VLOOKUP($L45,'All Individuals Day 1 (ALL)'!$C$3:$G$277,5,FALSE)+VLOOKUP($L45,#REF!,5,FALSE))","v":{"$error":"#REF!"}},{"$f":"IF(ISNA(VLOOKUP($L45,'All Individuals Day 1 (ALL)'!$C$3:$K$277,8,FALSE))=TRUE,\"\",VLOOKUP($L45,'All Individuals Day 1 (ALL)'!$C$3:$K$277,8,FALSE))","v":3},{"$f":"IF(ISNA(VLOOKUP($L45,#REF!,8,FALSE))=TRUE,\"\",VLOOKUP($L45,#REF!,8,FALSE))","v":{"$error":"#REF!"}},{"$error":"#REF!"}]
[{"$f":"VLOOKUP($B46,#REF!,2,FALSE)","v":{"$error":"#N/A"}},{"$error":"#N/A"},{"$error":"#N/A"},{"$error":"#N/A"},{"$error":"#N/A"},{"$error":"#N/A"},{"$error":"#N/A"},43,null,null,{"$error":"#REF!"},43,{"$f":"IF(ISNA(VLOOKUP($L46,'All Individuals Day 1 (ALL)'!$C$3:$G$277,4,FALSE)+VLOOKUP($L46,#REF!,4,FALSE))=TRUE,\"\",VLOOKUP($L46,'All Individuals Day 1 (ALL)'!$C$3:$G$277,4,FALSE)+VLOOKUP($L46,#REF!,4,FALSE))","v":{"$error":"#REF!"}},{"$f":"IF(ISNA(VLOOKUP($L46,'All Individuals Day 1 (ALL)'!$C$3:$G$277,5,FALSE)+VLOOKUP($L46,#REF!,5,FALSE))=TRUE,\"\",VLOOKUP($L46,'All Individuals Day 1 (ALL)'!$C$3:$G$277,5,FALSE)+VLOOKUP($L46,#REF!,5,FALSE))","v":{"$error":"#REF!"}},{"$f":"IF(ISNA(VLOOKUP($L46,'All Individuals Day 1 (ALL)'!$C$3:$K$277,8,FALSE))=TRUE,\"\",VLOOKUP($L46,'All Individuals Day 1 (ALL)'!$C$3:$K$277,8,FALSE))","v":11},{"$f":"IF(ISNA(VLOOKUP($L46,#REF!,8,FALSE))=TRUE,\"\",VLOOKUP($L46,#REF!,8,FALSE))","v":{"$error":"#REF!"}},{"$error":"#REF!"}]
[{"$f":"VLOOKUP($B47,#REF!,2,FALSE)","v":{"$error":"#N/A"}},{"$error":"#N/A"},{"$error":"#N/A"},{"$error":"#N/A"},{"$error":"#N/A"},{"$error":"#N/A"},{"$error":"#N/A"},44,null,null,{"$error":"#REF!"},44,{"$f":"IF(ISNA(VLOOKUP($L47,'All Individuals Day 1 (ALL)'!$C$3:$G$277,4,FALSE)+VLOOKUP($L47,#REF!,4,FALSE))=TRUE,\"\",VLOOKUP($L47,'All Individuals Day 1 (ALL)'!$C$3:$G$277,4,FALSE)+VLOOKUP($L47,#REF!,4,FALSE))","v":{"$error":"#REF!"}},{"$f":"IF(ISNA(VLOOKUP($L47,'All Individuals Day 1 (ALL)'!$C$3:$G$277,5,FALSE)+VLOOKUP($L47,#REF!,5,FALSE))=TRUE,\"\",VLOOKUP($L47,'All Individuals Day 1 (ALL)'!$C$3:$G$277,5,FALSE)+VLOOKUP($L47,#REF!,5,FALSE))","v":{"$error":"#REF!"}},{"$f":"IF(ISNA(VLOOKUP($L47,'All Individuals Day 1 (ALL)'!$C$3:$K$277,8,FALSE))=TRUE,\"\",VLOOKUP($L47,'All Individuals Day 1 (ALL)'!$C$3:$K$277,8,FALSE))","v":3},{"$f":"IF(ISNA(VLOOKUP($L47,#REF!,8,FALSE))=TRUE,\"\",VLOOKUP($L47,#REF!,8,FALSE))","v":{"$error":"#REF!"}},{"$error":"#REF!"}]
[{"$f":"VLOOKUP($B48,#REF!,2,FALSE)","v":{"$error":"#N/A"}},{"$error":"#N/A"},{"$error":"#N/A"},{"$error":"#N/A"},{"$error":"#N/A"},{"$error":"#N/A"},{"$error":"#N/A"},45,null,null,{"$error":"#REF!"},45,{"$f":"IF(ISNA(VLOOKUP($L48,'All Individuals Day 1 (ALL)'!$C$3:$G$277,4,FALSE)+VLOOKUP($L48,#REF!,4,FALSE))=TRUE,\"\",VLOOKUP($L48,'All Individuals Day 1 (ALL)'!$C$3:$G$277,4,FALSE)+VLOOKUP($L48,#REF!,4,FALSE))","v":{"$error":"#REF!"}},{"$f":"IF(ISNA(VLOOKUP($L48,'All Individuals Day 1 (ALL)'!$C$3:$G$277,5,FALSE)+VLOOKUP($L48,#REF!,5,FALSE))=TRUE,\"\",VLOOKUP($L48,'All Individuals Day 1 (ALL)'!$C$3:$G$277,5,FALSE)+VLOOKUP($L48,#REF!,5,FALSE))","v":{"$error":"#REF!"}},{"$f":"IF(ISNA(VLOOKUP($L48,'All Individuals Day 1 (ALL)'!$C$3:$K$277,8,FALSE))=TRUE,\"\",VLOOKUP($L48,'All Individuals Day 1 (ALL)'!$C$3:$K$277,8,FALSE))","v":10},{"$f":"IF(ISNA(VLOOKUP($L48,#REF!,8,FALSE))=TRUE,\"\",VLOOKUP($L48,#REF!,8,FALSE))","v":{"$error":"#REF!"}},{"$error":"#REF!"}]
[{"$f":"VLOOKUP($B49,#REF!,2,FALSE)","v":{"$error":"#N/A"}},{"$error":"#N/A"},{"$error":"#N/A"},{"$error":"#N/A"},{"$error":"#N/A"},{"$error":"#N/A"},{"$error":"#N/A"},46,null,null,{"$error":"#REF!"},46,{"$f":"IF(ISNA(VLOOKUP($L49,'All Individuals Day 1 (ALL)'!$C$3:$G$277,4,FALSE)+VLOOKUP($L49,#REF!,4,FALSE))=TRUE,\"\",VLOOKUP($L49,'All Individuals Day 1 (ALL)'!$C$3:$G$277,4,FALSE)+VLOOKUP($L49,#REF!,4,FALSE))","v":{"$error":"#REF!"}},{"$f":"IF(ISNA(VLOOKUP($L49,'All Individuals Day 1 (ALL)'!$C$3:$G$277,5,FALSE)+VLOOKUP($L49,#REF!,5,FALSE))=TRUE,\"\",VLOOKUP($L49,'All Individuals Day 1 (ALL)'!$C$3:$G$277,5,FALSE)+VLOOKUP($L49,#REF!,5,FALSE))","v":{"$error":"#REF!"}},{"$f":"IF(ISNA(VLOOKUP($L49,'All Individuals Day 1 (ALL)'!$C$3:$K$277,8,FALSE))=TRUE,\"\",VLOOKUP($L49,'All Individuals Day 1 (ALL)'!$C$3:$K$277,8,FALSE))","v":16},{"$f":"IF(ISNA(VLOOKUP($L49,#REF!,8,FALSE))=TRUE,\"\",VLOOKUP($L49,#REF!,8,FALSE))","v":{"$error":"#REF!"}},{"$error":"#REF!"}]
[{"$f":"VLOOKUP($B50,#REF!,2,FALSE)","v":{"$error":"#N/A"}},{"$error":"#N/A"},{"$error":"#N/A"},{"$error":"#N/A"},{"$error":"#N/A"},{"$error":"#N/A"},{"$error":"#N/A"},47,null,null,{"$error":"#REF!"},47,{"$f":"IF(ISNA(VLOOKUP($L50,'All Individuals Day 1 (ALL)'!$C$3:$G$277,4,FALSE)+VLOOKUP($L50,#REF!,4,FALSE))=TRUE,\"\",VLOOKUP($L50,'All Individuals Day 1 (ALL)'!$C$3:$G$277,4,FALSE)+VLOOKUP($L50,#REF!,4,FALSE))","v":{"$error":"#REF!"}},{"$f":"IF(ISNA(VLOOKUP($L50,'All Individuals Day 1 (ALL)'!$C$3:$G$277,5,FALSE)+VLOOKUP($L50,#REF!,5,FALSE))=TRUE,\"\",VLOOKUP($L50,'All Individuals Day 1 (ALL)'!$C$3:$G$277,5,FALSE)+VLOOKUP($L50,#REF!,5,FALSE))","v":{"$error":"#REF!"}},{"$f":"IF(ISNA(VLOOKUP($L50,'All Individuals Day 1 (ALL)'!$C$3:$K$277,8,FALSE))=TRUE,\"\",VLOOKUP($L50,'All Individuals Day 1 (ALL)'!$C$3:$K$277,8,FALSE))","v":2},{"$f":"IF(ISNA(VLOOKUP($L50,#REF!,8,FALSE))=TRUE,\"\",VLOOKUP($L50,#REF!,8,FALSE))","v":{"$error":"#REF!"}},{"$error":"#REF!"}]
[{"$f":"VLOOKUP($B51,#REF!,2,FALSE)","v":{"$error":"#N/A"}},{"$error":"#N/A"},{"$error":"#N/A"},{"$error":"#N/A"},{"$error":"#N/A"},{"$error":"#N/A"},{"$error":"#N/A"},48,null,null,{"$error":"#REF!"},48,{"$f":"IF(ISNA(VLOOKUP($L51,'All Individuals Day 1 (ALL)'!$C$3:$G$277,4,FALSE)+VLOOKUP($L51,#REF!,4,FALSE))=TRUE,\"\",VLOOKUP($L51,'All Individuals Day 1 (ALL)'!$C$3:$G$277,4,FALSE)+VLOOKUP($L51,#REF!,4,FALSE))","v":{"$error":"#REF!"}},{"$f":"IF(ISNA(VLOOKUP($L51,'All Individuals Day 1 (ALL)'!$C$3:$G$277,5,FALSE)+VLOOKUP($L51,#REF!,5,FALSE))=TRUE,\"\",VLOOKUP($L51,'All Individuals Day 1 (ALL)'!$C$3:$G$277,5,FALSE)+VLOOKUP($L51,#REF!,5,FALSE))","v":{"$error":"#REF!"}},{"$f":"IF(ISNA(VLOOKUP($L51,'All Individuals Day 1 (ALL)'!$C$3:$K$277,8,FALSE))=TRUE,\"\",VLOOKUP($L51,'All Individuals Day 1 (ALL)'!$C$3:$K$277,8,FALSE))","v":7},{"$f":"IF(ISNA(VLOOKUP($L51,#REF!,8,FALSE))=TRUE,\"\",VLOOKUP($L51,#REF!,8,FALSE))","v":{"$error":"#REF!"}},{"$error":"#REF!"}]
[{"$f":"VLOOKUP($B52,#REF!,2,FALSE)","v":{"$error":"#N/A"}},{"$error":"#N/A"},{"$error":"#N/A"},{"$error":"#N/A"},{"$error":"#N/A"},{"$error":"#N/A"},{"$error":"#N/A"},49,null,null,{"$error":"#REF!"},49,{"$f":"IF(ISNA(VLOOKUP($L52,'All Individuals Day 1 (ALL)'!$C$3:$G$277,4,FALSE)+VLOOKUP($L52,#REF!,4,FALSE))=TRUE,\"\",VLOOKUP($L52,'All Individuals Day 1 (ALL)'!$C$3:$G$277,4,FALSE)+VLOOKUP($L52,#REF!,4,FALSE))","v":{"$error":"#REF!"}},{"$f":"IF(ISNA(VLOOKUP($L52,'All Individuals Day 1 (ALL)'!$C$3:$G$277,5,FALSE)+VLOOKUP($L52,#REF!,5,FALSE))=TRUE,\"\",VLOOKUP($L52,'All Individuals Day 1 (ALL)'!$C$3:$G$277,5,FALSE)+VLOOKUP($L52,#REF!,5,FALSE))","v":{"$error":"#REF!"}},{"$f":"IF(ISNA(VLOOKUP($L52,'All Individuals Day 1 (ALL)'!$C$3:$K$277,8,FALSE))=TRUE,\"\",VLOOKUP($L52,'All Individuals Day 1 (ALL)'!$C$3:$K$277,8,FALSE))","v":11},{"$f":"IF(ISNA(VLOOKUP($L52,#REF!,8,FALSE))=TRUE,\"\",VLOOKUP($L52,#REF!,8,FALSE))","v":{"$error":"#REF!"}},{"$error":"#REF!"}]
[{"$f":"VLOOKUP($B53,#REF!,2,FALSE)","v":{"$error":"#N/A"}},{"$error":"#N/A"},{"$error":"#N/A"},{"$error":"#N/A"},{"$error":"#N/A"},{"$error":"#N/A"},{"$error":"#N/A"},50,null,null,{"$error":"#REF!"},50,{"$f":"IF(ISNA(VLOOKUP($L53,'All Individuals Day 1 (ALL)'!$C$3:$G$277,4,FALSE)+VLOOKUP($L53,#REF!,4,FALSE))=TRUE,\"\",VLOOKUP($L53,'All Individuals Day 1 (ALL)'!$C$3:$G$277,4,FALSE)+VLOOKUP($L53,#REF!,4,FALSE))","v":{"$error":"#REF!"}},{"$f":"IF(ISNA(VLOOKUP($L53,'All Individuals Day 1 (ALL)'!$C$3:$G$277,5,FALSE)+VLOOKUP($L53,#REF!,5,FALSE))=TRUE,\"\",VLOOKUP($L53,'All Individuals Day 1 (ALL)'!$C$3:$G$277,5,FALSE)+VLOOKUP($L53,#REF!,5,FALSE))","v":{"$error":"#REF!"}},{"$f":"IF(ISNA(VLOOKUP($L53,'All Individuals Day 1 (ALL)'!$C$3:$K$277,8,FALSE))=TRUE,\"\",VLOOKUP($L53,'All Individuals Day 1 (ALL)'!$C$3:$K$277,8,FALSE))","v":16},{"$f":"IF(ISNA(VLOOKUP($L53,#REF!,8,FALSE))=TRUE,\"\",VLOOKUP($L53,#REF!,8,FALSE))","v":{"$error":"#REF!"}},{"$error":"#REF!"}]
[{"$f":"VLOOKUP($B54,#REF!,2,FALSE)","v":{"$error":"#N/A"}},{"$error":"#N/A"},{"$error":"#N/A"},{"$error":"#N/A"},{"$error":"#N/A"},{"$error":"#N/A"},{"$error":"#N/A"},51,null,null,{"$error":"#REF!"},51,{"$f":"IF(ISNA(VLOOKUP($L54,'All Individuals Day 1 (ALL)'!$C$3:$G$277,4,FALSE)+VLOOKUP($L54,#REF!,4,FALSE))=TRUE,\"\",VLOOKUP($L54,'All Individuals Day 1 (ALL)'!$C$3:$G$277,4,FALSE)+VLOOKUP($L54,#REF!,4,FALSE))","v":{"$error":"#REF!"}},{"$f":"IF(ISNA(VLOOKUP($L54,'All Individuals Day 1 (ALL)'!$C$3:$G$277,5,FALSE)+VLOOKUP($L54,#REF!,5,FALSE))=TRUE,\"\",VLOOKUP($L54,'All Individuals Day 1 (ALL)'!$C$3:$G$277,5,FALSE)+VLOOKUP($L54,#REF!,5,FALSE))","v":{"$error":"#REF!"}},{"$f":"IF(ISNA(VLOOKUP($L54,'All Individuals Day 1 (ALL)'!$C$3:$K$277,8,FALSE))=TRUE,\"\",VLOOKUP($L54,'All Individuals Day 1 (ALL)'!$C$3:$K$277,8,FALSE))","v":11},{"$f":"IF(ISNA(VLOOKUP($L54,#REF!,8,FALSE))=TRUE,\"\",VLOOKUP($L54,#REF!,8,FALSE))","v":{"$error":"#REF!"}},{"$error":"#REF!"}]
[{"$f":"VLOOKUP($B55,#REF!,2,FALSE)","v":{"$error":"#N/A"}},{"$error":"#N/A"},{"$error":"#N/A"},{"$error":"#N/A"},{"$error":"#N/A"},{"$error":"#N/A"},{"$error":"#N/A"},52,null,null,{"$error":"#REF!"},52,{"$f":"IF(ISNA(VLOOKUP($L55,'All Individuals Day 1 (ALL)'!$C$3:$G$277,4,FALSE)+VLOOKUP($L55,#REF!,4,FALSE))=TRUE,\"\",VLOOKUP($L55,'All Individuals Day 1 (ALL)'!$C$3:$G$277,4,FALSE)+VLOOKUP($L55,#REF!,4,FALSE))","v":{"$error":"#REF!"}},{"$f":"IF(ISNA(VLOOKUP($L55,'All Individuals Day 1 (ALL)'!$C$3:$G$277,5,FALSE)+VLOOKUP($L55,#REF!,5,FALSE))=TRUE,\"\",VLOOKUP($L55,'All Individuals Day 1 (ALL)'!$C$3:$G$277,5,FALSE)+VLOOKUP($L55,#REF!,5,FALSE))","v":{"$error":"#REF!"}},{"$f":"IF(ISNA(VLOOKUP($L55,'All Individuals Day 1 (ALL)'!$C$3:$K$277,8,FALSE))=TRUE,\"\",VLOOKUP($L55,'All Individuals Day 1 (ALL)'!$C$3:$K$277,8,FALSE))","v":15},{"$f":"IF(ISNA(VLOOKUP($L55,#REF!,8,FALSE))=TRUE,\"\",VLOOKUP($L55,#REF!,8,FALSE))","v":{"$error":"#REF!"}},{"$error":"#REF!"}]
[{"$f":"VLOOKUP($B56,#REF!,2,FALSE)","v":{"$error":"#N/A"}},{"$error":"#N/A"},{"$error":"#N/A"},{"$error":"#N/A"},{"$error":"#N/A"},{"$error":"#N/A"},{"$error":"#N/A"},53,null,null,{"$error":"#REF!"},53,{"$f":"IF(ISNA(VLOOKUP($L56,'All Individuals Day 1 (ALL)'!$C$3:$G$277,4,FALSE)+VLOOKUP($L56,#REF!,4,FALSE))=TRUE,\"\",VLOOKUP($L56,'All Individuals Day 1 (ALL)'!$C$3:$G$277,4,FALSE)+VLOOKUP($L56,#REF!,4,FALSE))","v":{"$error":"#REF!"}},{"$f":"IF(ISNA(VLOOKUP($L56,'All Individuals Day 1 (ALL)'!$C$3:$G$277,5,FALSE)+VLOOKUP($L56,#REF!,5,FALSE))=TRUE,\"\",VLOOKUP($L56,'All Individuals Day 1 (ALL)'!$C$3:$G$277,5,FALSE)+VLOOKUP($L56,#REF!,5,FALSE))","v":{"$error":"#REF!"}},{"$f":"IF(ISNA(VLOOKUP($L56,'All Individuals Day 1 (ALL)'!$C$3:$K$277,8,FALSE))=TRUE,\"\",VLOOKUP($L56,'All Individuals Day 1 (ALL)'!$C$3:$K$277,8,FALSE))","v":11},{"$f":"IF(ISNA(VLOOKUP($L56,#REF!,8,FALSE))=TRUE,\"\",VLOOKUP($L56,#REF!,8,FALSE))","v":{"$error":"#REF!"}},{"$error":"#REF!"}]
[{"$f":"VLOOKUP($B57,#REF!,2,FALSE)","v":{"$error":"#N/A"}},{"$error":"#N/A"},{"$error":"#N/A"},{"$error":"#N/A"},{"$error":"#N/A"},{"$error":"#N/A"},{"$error":"#N/A"},54,null,null,{"$error":"#REF!"},54,{"$f":"IF(ISNA(VLOOKUP($L57,'All Individuals Day 1 (ALL)'!$C$3:$G$277,4,FALSE)+VLOOKUP($L57,#REF!,4,FALSE))=TRUE,\"\",VLOOKUP($L57,'All Individuals Day 1 (ALL)'!$C$3:$G$277,4,FALSE)+VLOOKUP($L57,#REF!,4,FALSE))","v":{"$error":"#REF!"}},{"$f":"IF(ISNA(VLOOKUP($L57,'All Individuals Day 1 (ALL)'!$C$3:$G$277,5,FALSE)+VLOOKUP($L57,#REF!,5,FALSE))=TRUE,\"\",VLOOKUP($L57,'All Individuals Day 1 (ALL)'!$C$3:$G$277,5,FALSE)+VLOOKUP($L57,#REF!,5,FALSE))","v":{"$error":"#REF!"}},{"$f":"IF(ISNA(VLOOKUP($L57,'All Individuals Day 1 (ALL)'!$C$3:$K$277,8,FALSE))=TRUE,\"\",VLOOKUP($L57,'All Individuals Day 1 (ALL)'!$C$3:$K$277,8,FALSE))","v":16},{"$f":"IF(ISNA(VLOOKUP($L57,#REF!,8,FALSE))=TRUE,\"\",VLOOKUP($L57,#REF!,8,FALSE))","v":{"$error":"#REF!"}},{"$error":"#REF!"}]
[{"$f":"VLOOKUP($B58,#REF!,2,FALSE)","v":{"$error":"#N/A"}},{"$error":"#N/A"},{"$error":"#N/A"},{"$error":"#N/A"},{"$error":"#N/A"},{"$error":"#N/A"},{"$error":"#N/A"},55,null,null,{"$error":"#REF!"},55,{"$f":"IF(ISNA(VLOOKUP($L58,'All Individuals Day 1 (ALL)'!$C$3:$G$277,4,FALSE)+VLOOKUP($L58,#REF!,4,FALSE))=TRUE,\"\",VLOOKUP($L58,'All Individuals Day 1 (ALL)'!$C$3:$G$277,4,FALSE)+VLOOKUP($L58,#REF!,4,FALSE))","v":{"$error":"#REF!"}},{"$f":"IF(ISNA(VLOOKUP($L58,'All Individuals Day 1 (ALL)'!$C$3:$G$277,5,FALSE)+VLOOKUP($L58,#REF!,5,FALSE))=TRUE,\"\",VLOOKUP($L58,'All Individuals Day 1 (ALL)'!$C$3:$G$277,5,FALSE)+VLOOKUP($L58,#REF!,5,FALSE))","v":{"$error":"#REF!"}},{"$f":"IF(ISNA(VLOOKUP($L58,'All Individuals Day 1 (ALL)'!$C$3:$K$277,8,FALSE))=TRUE,\"\",VLOOKUP($L58,'All Individuals Day 1 (ALL)'!$C$3:$K$277,8,FALSE))","v":14},{"$f":"IF(ISNA(VLOOKUP($L58,#REF!,8,FALSE))=TRUE,\"\",VLOOKUP($L58,#REF!,8,FALSE))","v":{"$error":"#REF!"}},{"$error":"#REF!"}]
[{"$f":"VLOOKUP($B59,#REF!,2,FALSE)","v":{"$error":"#N/A"}},{"$error":"#N/A"},{"$error":"#N/A"},{"$error":"#N/A"},{"$error":"#N/A"},{"$error":"#N/A"},{"$error":"#N/A"},56,null,null,{"$error":"#REF!"},56,{"$f":"IF(ISNA(VLOOKUP($L59,'All Individuals Day 1 (ALL)'!$C$3:$G$277,4,FALSE)+VLOOKUP($L59,#REF!,4,FALSE))=TRUE,\"\",VLOOKUP($L59,'All Individuals Day 1 (ALL)'!$C$3:$G$277,4,FALSE)+VLOOKUP($L59,#REF!,4,FALSE))","v":{"$error":"#REF!"}},{"$f":"IF(ISNA(VLOOKUP($L59,'All Individuals Day 1 (ALL)'!$C$3:$G$277,5,FALSE)+VLOOKUP($L59,#REF!,5,FALSE))=TRUE,\"\",VLOOKUP($L59,'All Individuals Day 1 (ALL)'!$C$3:$G$277,5,FALSE)+VLOOKUP($L59,#REF!,5,FALSE))","v":{"$error":"#REF!"}},{"$f":"IF(ISNA(VLOOKUP($L59,'All Individuals Day 1 (ALL)'!$C$3:$K$277,8,FALSE))=TRUE,\"\",VLOOKUP($L59,'All Individuals Day 1 (ALL)'!$C$3:$K$277,8,FALSE))","v":16},{"$f":"IF(ISNA(VLOOKUP($L59,#REF!,8,FALSE))=TRUE,\"\",VLOOKUP($L59,#REF!,8,FALSE))","v":{"$error":"#REF!"}},{"$error":"#REF!"}]
[{"$f":"VLOOKUP($B60,#REF!,2,FALSE)","v":{"$error":"#N/A"}},{"$error":"#N/A"},{"$error":"#N/A"},{"$error":"#N/A"},{"$error":"#N/A"},{"$error":"#N/A"},{"$error":"#N/A"},57,null,null,{"$error":"#REF!"},57,{"$f":"IF(ISNA(VLOOKUP($L60,'All Individuals Day 1 (ALL)'!$C$3:$G$277,4,FALSE)+VLOOKUP($L60,#REF!,4,FALSE))=TRUE,\"\",VLOOKUP($L60,'All Individuals Day 1 (ALL)'!$C$3:$G$277,4,FALSE)+VLOOKUP($L60,#REF!,4,FALSE))","v":{"$error":"#REF!"}},{"$f":"IF(ISNA(VLOOKUP($L60,'All Individuals Day 1 (ALL)'!$C$3:$G$277,5,FALSE)+VLOOKUP($L60,#REF!,5,FALSE))=TRUE,\"\",VLOOKUP($L60,'All Individuals Day 1 (ALL)'!$C$3:$G$277,5,FALSE)+VLOOKUP($L60,#REF!,5,FALSE))","v":{"$error":"#REF!"}},{"$f":"IF(ISNA(VLOOKUP($L60,'All Individuals Day 1 (ALL)'!$C$3:$K$277,8,FALSE))=TRUE,\"\",VLOOKUP($L60,'All Individuals Day 1 (ALL)'!$C$3:$K$277,8,FALSE))","v":10},{"$f":"IF(ISNA(VLOOKUP($L60,#REF!,8,FALSE))=TRUE,\"\",VLOOKUP($L60,#REF!,8,FALSE))","v":{"$error":"#REF!"}},{"$error":"#REF!"}]
[{"$f":"VLOOKUP($B61,#REF!,2,FALSE)","v":{"$error":"#N/A"}},{"$error":"#N/A"},{"$error":"#N/A"},{"$error":"#N/A"},{"$error":"#N/A"},{"$error":"#N/A"},{"$error":"#N/A"},58,null,null,{"$error":"#REF!"},58,{"$f":"IF(ISNA(VLOOKUP($L61,'All Individuals Day 1 (ALL)'!$C$3:$G$277,4,FALSE)+VLOOKUP($L61,#REF!,4,FALSE))=TRUE,\"\",VLOOKUP($L61,'All Individuals Day 1 (ALL)'!$C$3:$G$277,4,FALSE)+VLOOKUP($L61,#REF!,4,FALSE))","v":{"$error":"#REF!"}},{"$f":"IF(ISNA(VLOOKUP($L61,'All Individuals Day 1 (ALL)'!$C$3:$G$277,5,FALSE)+VLOOKUP($L61,#REF!,5,FALSE))=TRUE,\"\",VLOOKUP($L61,'All Individuals Day 1 (ALL)'!$C$3:$G$277,5,FALSE)+VLOOKUP($L61,#REF!,5,FALSE))","v":{"$error":"#REF!"}},{"$f":"IF(ISNA(VLOOKUP($L61,'All Individuals Day 1 (ALL)'!$C$3:$K$277,8,FALSE))=TRUE,\"\",VLOOKUP($L61,'All Individuals Day 1 (ALL)'!$C$3:$K$277,8,FALSE))","v":16},{"$f":"IF(ISNA(VLOOKUP($L61,#REF!,8,FALSE))=TRUE,\"\",VLOOKUP($L61,#REF!,8,FALSE))","v":{"$error":"#REF!"}},{"$error":"#REF!"}]
[{"$f":"VLOOKUP($B62,#REF!,2,FALSE)","v":{"$error":"#N/A"}},{"$error":"#N/A"},{"$error":"#N/A"},{"$error":"#N/A"},{"$error":"#N/A"},{"$error":"#N/A"},{"$error":"#N/A"},59,null,null,{"$error":"#REF!"},59,{"$f":"IF(ISNA(VLOOKUP($L62,'All Individuals Day 1 (ALL)'!$C$3:$G$277,4,FALSE)+VLOOKUP($L62,#REF!,4,FALSE))=TRUE,\"\",VLOOKUP($L62,'All Individuals Day 1 (ALL)'!$C$3:$G$277,4,FALSE)+VLOOKUP($L62,#REF!,4,FALSE))","v":{"$error":"#REF!"}},{"$f":"IF(ISNA(VLOOKUP($L62,'All Individuals Day 1 (ALL)'!$C$3:$G$277,5,FALSE)+VLOOKUP($L62,#REF!,5,FALSE))=TRUE,\"\",VLOOKUP($L62,'All Individuals Day 1 (ALL)'!$C$3:$G$277,5,FALSE)+VLOOKUP($L62,#REF!,5,FALSE))","v":{"$error":"#REF!"}},{"$f":"IF(ISNA(VLOOKUP($L62,'All Individuals Day 1 (ALL)'!$C$3:$K$277,8,FALSE))=TRUE,\"\",VLOOKUP($L62,'All Individuals Day 1 (ALL)'!$C$3:$K$277,8,FALSE))","v":5},{"$f":"IF(ISNA(VLOOKUP($L62,#REF!,8,FALSE))=TRUE,\"\",VLOOKUP($L62,#REF!,8,FALSE))","v":{"$error":"#REF!"}},{"$error":"#REF!"}]
[{"$f":"VLOOKUP($B63,#REF!,2,FALSE)","v":{"$error":"#N/A"}},{"$error":"#N/A"},{"$error":"#N/A"},{"$error":"#N/A"},{"$error":"#N/A"},{"$error":"#N/A"},{"$error":"#N/A"},60,null,null,{"$error":"#REF!"},60,{"$f":"IF(ISNA(VLOOKUP($L63,'All Individuals Day 1 (ALL)'!$C$3:$G$277,4,FALSE)+VLOOKUP($L63,#REF!,4,FALSE))=TRUE,\"\",VLOOKUP($L63,'All Individuals Day 1 (ALL)'!$C$3:$G$277,4,FALSE)+VLOOKUP($L63,#REF!,4,FALSE))","v":{"$error":"#REF!"}},{"$f":"IF(ISNA(VLOOKUP($L63,'All Individuals Day 1 (ALL)'!$C$3:$G$277,5,FALSE)+VLOOKUP($L63,#REF!,5,FALSE))=TRUE,\"\",VLOOKUP($L63,'All Individuals Day 1 (ALL)'!$C$3:$G$277,5,FALSE)+VLOOKUP($L63,#REF!,5,FALSE))","v":{"$error":"#REF!"}},{"$f":"IF(ISNA(VLOOKUP($L63,'All Individuals Day 1 (ALL)'!$C$3:$K$277,8,FALSE))=TRUE,\"\",VLOOKUP($L63,'All Individuals Day 1 (ALL)'!$C$3:$K$277,8,FALSE))","v":9},{"$f":"IF(ISNA(VLOOKUP($L63,#REF!,8,FALSE))=TRUE,\"\",VLOOKUP($L63,#REF!,8,FALSE))","v":{"$error":"#REF!"}},{"$error":"#REF!"}]
[{"$f":"VLOOKUP($B64,#REF!,2,FALSE)","v":{"$error":"#N/A"}},{"$error":"#N/A"},{"$error":"#N/A"},{"$error":"#N/A"},{"$error":"#N/A"},{"$error":"#N/A"},{"$error":"#N/A"},61,null,null,{"$error":"#REF!"},61,{"$f":"IF(ISNA(VLOOKUP($L64,'All Individuals Day 1 (ALL)'!$C$3:$G$277,4,FALSE)+VLOOKUP($L64,#REF!,4,FALSE))=TRUE,\"\",VLOOKUP($L64,'All Individuals Day 1 (ALL)'!$C$3:$G$277,4,FALSE)+VLOOKUP($L64,#REF!,4,FALSE))","v":{"$error":"#REF!"}},{"$f":"IF(ISNA(VLOOKUP($L64,'All Individuals Day 1 (ALL)'!$C$3:$G$277,5,FALSE)+VLOOKUP($L64,#REF!,5,FALSE))=TRUE,\"\",VLOOKUP($L64,'All Individuals Day 1 (ALL)'!$C$3:$G$277,5,FALSE)+VLOOKUP($L64,#REF!,5,FALSE))","v":{"$error":"#REF!"}},{"$f":"IF(ISNA(VLOOKUP($L64,'All Individuals Day 1 (ALL)'!$C$3:$K$277,8,FALSE))=TRUE,\"\",VLOOKUP($L64,'All Individuals Day 1 (ALL)'!$C$3:$K$277,8,FALSE))","v":13},{"$f":"IF(ISNA(VLOOKUP($L64,#REF!,8,FALSE))=TRUE,\"\",VLOOKUP($L64,#REF!,8,FALSE))","v":{"$error":"#REF!"}},{"$error":"#REF!"}]
[{"$f":"VLOOKUP($B65,#REF!,2,FALSE)","v":{"$error":"#N/A"}},{"$error":"#N/A"},{"$error":"#N/A"},{"$error":"#N/A"},{"$error":"#N/A"},{"$error":"#N/A"},{"$error":"#N/A"},62,null,null,{"$error":"#REF!"},62,{"$f":"IF(ISNA(VLOOKUP($L65,'All Individuals Day 1 (ALL)'!$C$3:$G$277,4,FALSE)+VLOOKUP($L65,#REF!,4,FALSE))=TRUE,\"\",VLOOKUP($L65,'All Individuals Day 1 (ALL)'!$C$3:$G$277,4,FALSE)+VLOOKUP($L65,#REF!,4,FALSE))","v":{"$error":"#REF!"}},{"$f":"IF(ISNA(VLOOKUP($L65,'All Individuals Day 1 (ALL)'!$C$3:$G$277,5,FALSE)+VLOOKUP($L65,#REF!,5,FALSE))=TRUE,\"\",VLOOKUP($L65,'All Individuals Day 1 (ALL)'!$C$3:$G$277,5,FALSE)+VLOOKUP($L65,#REF!,5,FALSE))","v":{"$error":"#REF!"}},{"$f":"IF(ISNA(VLOOKUP($L65,'All Individuals Day 1 (ALL)'!$C$3:$K$277,8,FALSE))=TRUE,\"\",VLOOKUP($L65,'All Individuals Day 1 (ALL)'!$C$3:$K$277,8,FALSE))","v":16},{"$f":"IF(ISNA(VLOOKUP($L65,#REF!,8,FALSE))=TRUE,\"\",VLOOKUP($L65,#REF!,8,FALSE))","v":{"$error":"#REF!"}},{"$error":"#REF!"}]
[{"$f":"VLOOKUP($B66,#REF!,2,FALSE)","v":{"$error":"#N/A"}},{"$error":"#N/A"},{"$error":"#N/A"},{"$error":"#N/A"},{"$error":"#N/A"},{"$error":"#N/A"},{"$error":"#N/A"},{"$f":"IF(ISERROR(H65+1)=TRUE,1,H65+1)","v":63},null,null,{"$error":"#REF!"},63,{"$f":"IF(ISNA(VLOOKUP($L66,'All Individuals Day 1 (ALL)'!$C$3:$G$277,4,FALSE)+VLOOKUP($L66,#REF!,4,FALSE))=TRUE,\"\",VLOOKUP($L66,'All Individuals Day 1 (ALL)'!$C$3:$G$277,4,FALSE)+VLOOKUP($L66,#REF!,4,FALSE))","v":{"$error":"#REF!"}},{"$f":"IF(ISNA(VLOOKUP($L66,'All Individuals Day 1 (ALL)'!$C$3:$G$277,5,FALSE)+VLOOKUP($L66,#REF!,5,FALSE))=TRUE,\"\",VLOOKUP($L66,'All Individuals Day 1 (ALL)'!$C$3:$G$277,5,FALSE)+VLOOKUP($L66,#REF!,5,FALSE))","v":{"$error":"#REF!"}},{"$f":"IF(ISNA(VLOOKUP($L66,'All Individuals Day 1 (ALL)'!$C$3:$K$277,8,FALSE))=TRUE,\"\",VLOOKUP($L66,'All Individuals Day 1 (ALL)'!$C$3:$K$277,8,FALSE))","v":13},{"$f":"IF(ISNA(VLOOKUP($L66,#REF!,8,FALSE))=TRUE,\"\",VLOOKUP($L66,#REF!,8,FALSE))","v":{"$error":"#REF!"}},{"$error":"#REF!"}]
[{"$f":"VLOOKUP($B67,#REF!,2,FALSE)","v":{"$error":"#N/A"}},{"$error":"#N/A"},{"$error":"#N/A"},{"$error":"#N/A"},{"$error":"#N/A"},{"$error":"#N/A"},{"$error":"#N/A"},64,null,null,{"$error":"#REF!"},64,{"$f":"IF(ISNA(VLOOKUP($L67,'All Individuals Day 1 (ALL)'!$C$3:$G$277,4,FALSE)+VLOOKUP($L67,#REF!,4,FALSE))=TRUE,\"\",VLOOKUP($L67,'All Individuals Day 1 (ALL)'!$C$3:$G$277,4,FALSE)+VLOOKUP($L67,#REF!,4,FALSE))","v":{"$error":"#REF!"}},{"$f":"IF(ISNA(VLOOKUP($L67,'All Individuals Day 1 (ALL)'!$C$3:$G$277,5,FALSE)+VLOOKUP($L67,#REF!,5,FALSE))=TRUE,\"\",VLOOKUP($L67,'All Individuals Day 1 (ALL)'!$C$3:$G$277,5,FALSE)+VLOOKUP($L67,#REF!,5,FALSE))","v":{"$error":"#REF!"}},{"$f":"IF(ISNA(VLOOKUP($L67,'All Individuals Day 1 (ALL)'!$C$3:$K$277,8,FALSE))=TRUE,\"\",VLOOKUP($L67,'All Individuals Day 1 (ALL)'!$C$3:$K$277,8,FALSE))","v":9},{"$f":"IF(ISNA(VLOOKUP($L67,#REF!,8,FALSE))=TRUE,\"\",VLOOKUP($L67,#REF!,8,FALSE))","v":{"$error":"#REF!"}},{"$error":"#REF!"}]
[{"$f":"VLOOKUP($B68,#REF!,2,FALSE)","v":{"$error":"#N/A"}},{"$f":"VLOOKUP($H68,$K$4:$Q$300,2,FALSE)","v":{"$error":"#N/A"}},{"$f":"VLOOKUP($H68,$K$4:$Q$300,3,FALSE)","v":{"$error":"#N/A"}},{"$f":"VLOOKUP($H68,$K$4:$Q$300,4,FALSE)","v":{"$error":"#N/A"}},{"$f":"VLOOKUP($H68,$K$4:$Q$300,5,FALSE)","v":{"$error":"#N/A"}},{"$f":"VLOOKUP($H68,$K$4:$Q$300,6,FALSE)","v":{"$error":"#N/A"}},{"$f":"VLOOKUP($H68,$K$4:$Q$300,7,FALSE)","v":{"$error":"#N/A"}},65,null,null,{"$f":"IF(Q68=NpZ*NoZ*2,NpZ*NoZ,RANK(Q68,Q$4:Q$300,1))","v":{"$error":"#REF!"}},65,{"$f":"IF(ISNA(VLOOKUP($L68,'All Individuals Day 1 (ALL)'!$C$3:$G$277,4,FALSE)+VLOOKUP($L68,#REF!,4,FALSE))=TRUE,\"\",VLOOKUP($L68,'All Individuals Day 1 (ALL)'!$C$3:$G$277,4,FALSE)+VLOOKUP($L68,#REF!,4,FALSE))","v":{"$error":"#REF!"}},{"$f":"IF(ISNA(VLOOKUP($L68,'All Individuals Day 1 (ALL)'!$C$3:$G$277,5,FALSE)+VLOOKUP($L68,#REF!,5,FALSE))=TRUE,\"\",VLOOKUP($L68,'All Individuals Day 1 (ALL)'!$C$3:$G$277,5,FALSE)+VLOOKUP($L68,#REF!,5,FALSE))","v":{"$error":"#REF!"}},{"$f":"IF(ISNA(VLOOKUP($L68,'All Individuals Day 1 (ALL)'!$C$3:$K$277,8,FALSE))=TRUE,\"\",VLOOKUP($L68,'All Individuals Day 1 (ALL)'!$C$3:$K$277,8,FALSE))","v":9},{"$f":"IF(ISNA(VLOOKUP($L68,#REF!,8,FALSE))=TRUE,\"\",VLOOKUP($L68,#REF!,8,FALSE))","v":{"$error":"#REF!"}},{"$f":"IF(OR(M68=\"\",M68=0),NpZ*2,(O68+P68)-N68/100000-M68/1000000)","v":{"$error":"#REF!"}}]
[{"$f":"VLOOKUP($B69,#REF!,2,FALSE)","v":{"$error":"#N/A"}},{"$error":"#N/A"},{"$error":"#N/A"},{"$error":"#N/A"},{"$error":"#N/A"},{"$error":"#N/A"},{"$error":"#N/A"},66,null,null,{"$error":"#REF!"},66,{"$f":"IF(ISNA(VLOOKUP($L69,'All Individuals Day 1 (ALL)'!$C$3:$G$277,4,FALSE)+VLOOKUP($L69,#REF!,4,FALSE))=TRUE,\"\",VLOOKUP($L69,'All Individuals Day 1 (ALL)'!$C$3:$G$277,4,FALSE)+VLOOKUP($L69,#REF!,4,FALSE))","v":{"$error":"#REF!"}},{"$f":"IF(ISNA(VLOOKUP($L69,'All Individuals Day 1 (ALL)'!$C$3:$G$277,5,FALSE)+VLOOKUP($L69,#REF!,5,FALSE))=TRUE,\"\",VLOOKUP($L69,'All Individuals Day 1 (ALL)'!$C$3:$G$277,5,FALSE)+VLOOKUP($L69,#REF!,5,FALSE))","v":{"$error":"#REF!"}},{"$f":"IF(ISNA(VLOOKUP($L69,'All Individuals Day 1 (ALL)'!$C$3:$K$277,8,FALSE))=TRUE,\"\",VLOOKUP($L69,'All Individuals Day 1 (ALL)'!$C$3:$K$277,8,FALSE))","v":3},{"$f":"IF(ISNA(VLOOKUP($L69,#REF!,8,FALSE))=TRUE,\"\",VLOOKUP($L69,#REF!,8,FALSE))","v":{"$error":"#REF!"}},{"$error":"#REF!"}]
[{"$f":"VLOOKUP($B70,#REF!,2,FALSE)","v":{"$error":"#N/A"}},{"$error":"#N/A"},{"$error":"#N/A"},{"$error":"#N/A"},{"$error":"#N/A"},{"$error":"#N/A"},{"$error":"#N/A"},67,null,null,{"$error":"#REF!"},67,{"$f":"IF(ISNA(VLOOKUP($L70,'All Individuals Day 1 (ALL)'!$C$3:$G$277,4,FALSE)+VLOOKUP($L70,#REF!,4,FALSE))=TRUE,\"\",VLOOKUP($L70,'All Individuals Day 1 (ALL)'!$C$3:$G$277,4,FALSE)+VLOOKUP($L70,#REF!,4,FALSE))","v":{"$error":"#REF!"}},{"$f":"IF(ISNA(VLOOKUP($L70,'All Individuals Day 1 (ALL)'!$C$3:$G$277,5,FALSE)+VLOOKUP($L70,#REF!,5,FALSE))=TRUE,\"\",VLOOKUP($L70,'All Individuals Day 1 (ALL)'!$C$3:$G$277,5,FALSE)+VLOOKUP($L70,#REF!,5,FALSE))","v":{"$error":"#REF!"}},{"$f":"IF(ISNA(VLOOKUP($L70,'All Individuals Day 1 (ALL)'!$C$3:$K$277,8,FALSE))=TRUE,\"\",VLOOKUP($L70,'All Individuals Day 1 (ALL)'!$C$3:$K$277,8,FALSE))","v":16},{"$f":"IF(ISNA(VLOOKUP($L70,#REF!,8,FALSE))=TRUE,\"\",VLOOKUP($L70,#REF!,8,FALSE))","v":{"$error":"#REF!"}},{"$error":"#REF!"}]
[{"$f":"VLOOKUP($B71,#REF!,2,FALSE)","v":{"$error":"#N/A"}},{"$error":"#N/A"},{"$error":"#N/A"},{"$error":"#N/A"},{"$error":"#N/A"},{"$error":"#N/A"},{"$error":"#N/A"},68,null,null,{"$error":"#REF!"},68,{"$f":"IF(ISNA(VLOOKUP($L71,'All Individuals Day 1 (ALL)'!$C$3:$G$277,4,FALSE)+VLOOKUP($L71,#REF!,4,FALSE))=TRUE,\"\",VLOOKUP($L71,'All Individuals Day 1 (ALL)'!$C$3:$G$277,4,FALSE)+VLOOKUP($L71,#REF!,4,FALSE))","v":{"$error":"#REF!"}},{"$f":"IF(ISNA(VLOOKUP($L71,'All Individuals Day 1 (ALL)'!$C$3:$G$277,5,FALSE)+VLOOKUP($L71,#REF!,5,FALSE))=TRUE,\"\",VLOOKUP($L71,'All Individuals Day 1 (ALL)'!$C$3:$G$277,5,FALSE)+VLOOKUP($L71,#REF!,5,FALSE))","v":{"$error":"#REF!"}},{"$f":"IF(ISNA(VLOOKUP($L71,'All Individuals Day 1 (ALL)'!$C$3:$K$277,8,FALSE))=TRUE,\"\",VLOOKUP($L71,'All Individuals Day 1 (ALL)'!$C$3:$K$277,8,FALSE))","v":4},{"$f":"IF(ISNA(VLOOKUP($L71,#REF!,8,FALSE))=TRUE,\"\",VLOOKUP($L71,#REF!,8,FALSE))","v":{"$error":"#REF!"}},{"$error":"#REF!"}]
[{"$f":"VLOOKUP($B72,#REF!,2,FALSE)","v":{"$error":"#N/A"}},{"$error":"#N/A"},{"$error":"#N/A"},{"$error":"#N/A"},{"$error":"#N/A"},{"$error":"#N/A"},{"$error":"#N/A"},69,null,null,{"$error":"#REF!"},69,{"$f":"IF(ISNA(VLOOKUP($L72,'All Individuals Day 1 (ALL)'!$C$3:$G$277,4,FALSE)+VLOOKUP($L72,#REF!,4,FALSE))=TRUE,\"\",VLOOKUP($L72,'All Individuals Day 1 (ALL)'!$C$3:$G$277,4,FALSE)+VLOOKUP($L72,#REF!,4,FALSE))","v":{"$error":"#REF!"}},{"$f":"IF(ISNA(VLOOKUP($L72,'All Individuals Day 1 (ALL)'!$C$3:$G$277,5,FALSE)+VLOOKUP($L72,#REF!,5,FALSE))=TRUE,\"\",VLOOKUP($L72,'All Individuals Day 1 (ALL)'!$C$3:$G$277,5,FALSE)+VLOOKUP($L72,#REF!,5,FALSE))","v":{"$error":"#REF!"}},{"$f":"IF(ISNA(VLOOKUP($L72,'All Individuals Day 1 (ALL)'!$C$3:$K$277,8,FALSE))=TRUE,\"\",VLOOKUP($L72,'All Individuals Day 1 (ALL)'!$C$3:$K$277,8,FALSE))","v":7},{"$f":"IF(ISNA(VLOOKUP($L72,#REF!,8,FALSE))=TRUE,\"\",VLOOKUP($L72,#REF!,8,FALSE))","v":{"$error":"#REF!"}},{"$error":"#REF!"}]
[{"$f":"VLOOKUP($B73,#REF!,2,FALSE)","v":{"$error":"#N/A"}},{"$error":"#N/A"},{"$error":"#N/A"},{"$error":"#N/A"},{"$error":"#N/A"},{"$error":"#N/A"},{"$error":"#N/A"},70,null,null,{"$error":"#REF!"},70,{"$f":"IF(ISNA(VLOOKUP($L73,'All Individuals Day 1 (ALL)'!$C$3:$G$277,4,FALSE)+VLOOKUP($L73,#REF!,4,FALSE))=TRUE,\"\",VLOOKUP($L73,'All Individuals Day 1 (ALL)'!$C$3:$G$277,4,FALSE)+VLOOKUP($L73,#REF!,4,FALSE))","v":{"$error":"#REF!"}},{"$f":"IF(ISNA(VLOOKUP($L73,'All Individuals Day 1 (ALL)'!$C$3:$G$277,5,FALSE)+VLOOKUP($L73,#REF!,5,FALSE))=TRUE,\"\",VLOOKUP($L73,'All Individuals Day 1 (ALL)'!$C$3:$G$277,5,FALSE)+VLOOKUP($L73,#REF!,5,FALSE))","v":{"$error":"#REF!"}},{"$f":"IF(ISNA(VLOOKUP($L73,'All Individuals Day 1 (ALL)'!$C$3:$K$277,8,FALSE))=TRUE,\"\",VLOOKUP($L73,'All Individuals Day 1 (ALL)'!$C$3:$K$277,8,FALSE))","v":16},{"$f":"IF(ISNA(VLOOKUP($L73,#REF!,8,FALSE))=TRUE,\"\",VLOOKUP($L73,#REF!,8,FALSE))","v":{"$error":"#REF!"}},{"$error":"#REF!"}]
[{"$f":"VLOOKUP($B74,#REF!,2,FALSE)","v":{"$error":"#N/A"}},{"$error":"#N/A"},{"$error":"#N/A"},{"$error":"#N/A"},{"$error":"#N/A"},{"$error":"#N/A"},{"$error":"#N/A"},71,null,null,{"$error":"#REF!"},71,{"$f":"IF(ISNA(VLOOKUP($L74,'All Individuals Day 1 (ALL)'!$C$3:$G$277,4,FALSE)+VLOOKUP($L74,#REF!,4,FALSE))=TRUE,\"\",VLOOKUP($L74,'All Individuals Day 1 (ALL)'!$C$3:$G$277,4,FALSE)+VLOOKUP($L74,#REF!,4,FALSE))","v":{"$error":"#REF!"}},{"$f":"IF(ISNA(VLOOKUP($L74,'All Individuals Day 1 (ALL)'!$C$3:$G$277,5,FALSE)+VLOOKUP($L74,#REF!,5,FALSE))=TRUE,\"\",VLOOKUP($L74,'All Individuals Day 1 (ALL)'!$C$3:$G$277,5,FALSE)+VLOOKUP($L74,#REF!,5,FALSE))","v":{"$error":"#REF!"}},{"$f":"IF(ISNA(VLOOKUP($L74,'All Individuals Day 1 (ALL)'!$C$3:$K$277,8,FALSE))=TRUE,\"\",VLOOKUP($L74,'All Individuals Day 1 (ALL)'!$C$3:$K$277,8,FALSE))","v":12},{"$f":"IF(ISNA(VLOOKUP($L74,#REF!,8,FALSE))=TRUE,\"\",VLOOKUP($L74,#REF!,8,FALSE))","v":{"$error":"#REF!"}},{"$error":"#REF!"}]
[{"$f":"VLOOKUP($B75,#REF!,2,FALSE)","v":{"$error":"#N/A"}},{"$error":"#N/A"},{"$error":"#N/A"},{"$error":"#N/A"},{"$error":"#N/A"},{"$error":"#N/A"},{"$error":"#N/A"},72,null,null,{"$error":"#REF!"},72,{"$f":"IF(ISNA(VLOOKUP($L75,'All Individuals Day 1 (ALL)'!$C$3:$G$277,4,FALSE)+VLOOKUP($L75,#REF!,4,FALSE))=TRUE,\"\",VLOOKUP($L75,'All Individuals Day 1 (ALL)'!$C$3:$G$277,4,FALSE)+VLOOKUP($L75,#REF!,4,FALSE))","v":{"$error":"#REF!"}},{"$f":"IF(ISNA(VLOOKUP($L75,'All Individuals Day 1 (ALL)'!$C$3:$G$277,5,FALSE)+VLOOKUP($L75,#REF!,5,FALSE))=TRUE,\"\",VLOOKUP($L75,'All Individuals Day 1 (ALL)'!$C$3:$G$277,5,FALSE)+VLOOKUP($L75,#REF!,5,FALSE))","v":{"$error":"#REF!"}},{"$f":"IF(ISNA(VLOOKUP($L75,'All Individuals Day 1 (ALL)'!$C$3:$K$277,8,FALSE))=TRUE,\"\",VLOOKUP($L75,'All Individuals Day 1 (ALL)'!$C$3:$K$277,8,FALSE))","v":10},{"$f":"IF(ISNA(VLOOKUP($L75,#REF!,8,FALSE))=TRUE,\"\",VLOOKUP($L75,#REF!,8,FALSE))","v":{"$error":"#REF!"}},{"$error":"#REF!"}]
[{"$f":"VLOOKUP($B76,#REF!,2,FALSE)","v":{"$error":"#N/A"}},{"$error":"#N/A"},{"$error":"#N/A"},{"$error":"#N/A"},{"$error":"#N/A"},{"$error":"#N/A"},{"$error":"#N/A"},73,null,null,{"$error":"#REF!"},73,{"$f":"IF(ISNA(VLOOKUP($L76,'All Individuals Day 1 (ALL)'!$C$3:$G$277,4,FALSE)+VLOOKUP($L76,#REF!,4,FALSE))=TRUE,\"\",VLOOKUP($L76,'All Individuals Day 1 (ALL)'!$C$3:$G$277,4,FALSE)+VLOOKUP($L76,#REF!,4,FALSE))","v":{"$error":"#REF!"}},{"$f":"IF(ISNA(VLOOKUP($L76,'All Individuals Day 1 (ALL)'!$C$3:$G$277,5,FALSE)+VLOOKUP($L76,#REF!,5,FALSE))=TRUE,\"\",VLOOKUP($L76,'All Individuals Day 1 (ALL)'!$C$3:$G$277,5,FALSE)+VLOOKUP($L76,#REF!,5,FALSE))","v":{"$error":"#REF!"}},{"$f":"IF(ISNA(VLOOKUP($L76,'All Individuals Day 1 (ALL)'!$C$3:$K$277,8,FALSE))=TRUE,\"\",VLOOKUP($L76,'All Individuals Day 1 (ALL)'!$C$3:$K$277,8,FALSE))","v":14},{"$f":"IF(ISNA(VLOOKUP($L76,#REF!,8,FALSE))=TRUE,\"\",VLOOKUP($L76,#REF!,8,FALSE))","v":{"$error":"#REF!"}},{"$error":"#REF!"}]
[{"$f":"VLOOKUP($B77,#REF!,2,FALSE)","v":{"$error":"#N/A"}},{"$error":"#N/A"},{"$error":"#N/A"},{"$error":"#N/A"},{"$error":"#N/A"},{"$error":"#N/A"},{"$error":"#N/A"},74,null,null,{"$error":"#REF!"},74,{"$f":"IF(ISNA(VLOOKUP($L77,'All Individuals Day 1 (ALL)'!$C$3:$G$277,4,FALSE)+VLOOKUP($L77,#REF!,4,FALSE))=TRUE,\"\",VLOOKUP($L77,'All Individuals Day 1 (ALL)'!$C$3:$G$277,4,FALSE)+VLOOKUP($L77,#REF!,4,FALSE))","v":{"$error":"#REF!"}},{"$f":"IF(ISNA(VLOOKUP($L77,'All Individuals Day 1 (ALL)'!$C$3:$G$277,5,FALSE)+VLOOKUP($L77,#REF!,5,FALSE))=TRUE,\"\",VLOOKUP($L77,'All Individuals Day 1 (ALL)'!$C$3:$G$277,5,FALSE)+VLOOKUP($L77,#REF!,5,FALSE))","v":{"$error":"#REF!"}},{"$f":"IF(ISNA(VLOOKUP($L77,'All Individuals Day 1 (ALL)'!$C$3:$K$277,8,FALSE))=TRUE,\"\",VLOOKUP($L77,'All Individuals Day 1 (ALL)'!$C$3:$K$277,8,FALSE))","v":3},{"$f":"IF(ISNA(VLOOKUP($L77,#REF!,8,FALSE))=TRUE,\"\",VLOOKUP($L77,#REF!,8,FALSE))","v":{"$error":"#REF!"}},{"$error":"#REF!"}]
[{"$f":"VLOOKUP($B78,#REF!,2,FALSE)","v":{"$error":"#N/A"}},{"$error":"#N/A"},{"$error":"#N/A"},{"$error":"#N/A"},{"$error":"#N/A"},{"$error":"#N/A"},{"$error":"#N/A"},75,null,null,{"$error":"#REF!"},75,{"$f":"IF(ISNA(VLOOKUP($L78,'All Individuals Day 1 (ALL)'!$C$3:$G$277,4,FALSE)+VLOOKUP($L78,#REF!,4,FALSE))=TRUE,\"\",VLOOKUP($L78,'All Individuals Day 1 (ALL)'!$C$3:$G$277,4,FALSE)+VLOOKUP($L78,#REF!,4,FALSE))","v":{"$error":"#REF!"}},{"$f":"IF(ISNA(VLOOKUP($L78,'All Individuals Day 1 (ALL)'!$C$3:$G$277,5,FALSE)+VLOOKUP($L78,#REF!,5,FALSE))=TRUE,\"\",VLOOKUP($L78,'All Individuals Day 1 (ALL)'!$C$3:$G$277,5,FALSE)+VLOOKUP($L78,#REF!,5,FALSE))","v":{"$error":"#REF!"}},{"$f":"IF(ISNA(VLOOKUP($L78,'All Individuals Day 1 (ALL)'!$C$3:$K$277,8,FALSE))=TRUE,\"\",VLOOKUP($L78,'All Individuals Day 1 (ALL)'!$C$3:$K$277,8,FALSE))","v":6},{"$f":"IF(ISNA(VLOOKUP($L78,#REF!,8,FALSE))=TRUE,\"\",VLOOKUP($L78,#REF!,8,FALSE))","v":{"$error":"#REF!"}},{"$error":"#REF!"}]
[{"$f":"VLOOKUP($B79,#REF!,2,FALSE)","v":{"$error":"#N/A"}},{"$error":"#N/A"},{"$error":"#N/A"},{"$error":"#N/A"},{"$error":"#N/A"},{"$error":"#N/A"},{"$error":"#N/A"},76,null,null,{"$error":"#REF!"},76,{"$f":"IF(ISNA(VLOOKUP($L79,'All Individuals Day 1 (ALL)'!$C$3:$G$277,4,FALSE)+VLOOKUP($L79,#REF!,4,FALSE))=TRUE,\"\",VLOOKUP($L79,'All Individuals Day 1 (ALL)'!$C$3:$G$277,4,FALSE)+VLOOKUP($L79,#REF!,4,FALSE))","v":{"$error":"#REF!"}},{"$f":"IF(ISNA(VLOOKUP($L79,'All Individuals Day 1 (ALL)'!$C$3:$G$277,5,FALSE)+VLOOKUP($L79,#REF!,5,FALSE))=TRUE,\"\",VLOOKUP($L79,'All Individuals Day 1 (ALL)'!$C$3:$G$277,5,FALSE)+VLOOKUP($L79,#REF!,5,FALSE))","v":{"$error":"#REF!"}},{"$f":"IF(ISNA(VLOOKUP($L79,'All Individuals Day 1 (ALL)'!$C$3:$K$277,8,FALSE))=TRUE,\"\",VLOOKUP($L79,'All Individuals Day 1 (ALL)'!$C$3:$K$277,8,FALSE))","v":4},{"$f":"IF(ISNA(VLOOKUP($L79,#REF!,8,FALSE))=TRUE,\"\",VLOOKUP($L79,#REF!,8,FALSE))","v":{"$error":"#REF!"}},{"$error":"#REF!"}]
[{"$f":"VLOOKUP($B80,#REF!,2,FALSE)","v":{"$error":"#N/A"}},{"$error":"#N/A"},{"$error":"#N/A"},{"$error":"#N/A"},{"$error":"#N/A"},{"$error":"#N/A"},{"$error":"#N/A"},77,null,null,{"$error":"#REF!"},77,{"$f":"IF(ISNA(VLOOKUP($L80,'All Individuals Day 1 (ALL)'!$C$3:$G$277,4,FALSE)+VLOOKUP($L80,#REF!,4,FALSE))=TRUE,\"\",VLOOKUP($L80,'All Individuals Day 1 (ALL)'!$C$3:$G$277,4,FALSE)+VLOOKUP($L80,#REF!,4,FALSE))","v":{"$error":"#REF!"}},{"$f":"IF(ISNA(VLOOKUP($L80,'All Individuals Day 1 (ALL)'!$C$3:$G$277,5,FALSE)+VLOOKUP($L80,#REF!,5,FALSE))=TRUE,\"\",VLOOKUP($L80,'All Individuals Day 1 (ALL)'!$C$3:$G$277,5,FALSE)+VLOOKUP($L80,#REF!,5,FALSE))","v":{"$error":"#REF!"}},{"$f":"IF(ISNA(VLOOKUP($L80,'All Individuals Day 1 (ALL)'!$C$3:$K$277,8,FALSE))=TRUE,\"\",VLOOKUP($L80,'All Individuals Day 1 (ALL)'!$C$3:$K$277,8,FALSE))","v":16},{"$f":"IF(ISNA(VLOOKUP($L80,#REF!,8,FALSE))=TRUE,\"\",VLOOKUP($L80,#REF!,8,FALSE))","v":{"$error":"#REF!"}},{"$error":"#REF!"}]
[{"$f":"VLOOKUP($B81,#REF!,2,FALSE)","v":{"$error":"#N/A"}},{"$error":"#N/A"},{"$error":"#N/A"},{"$error":"#N/A"},{"$error":"#N/A"},{"$error":"#N/A"},{"$error":"#N/A"},78,null,null,{"$error":"#REF!"},78,{"$f":"IF(ISNA(VLOOKUP($L81,'All Individuals Day 1 (ALL)'!$C$3:$G$277,4,FALSE)+VLOOKUP($L81,#REF!,4,FALSE))=TRUE,\"\",VLOOKUP($L81,'All Individuals Day 1 (ALL)'!$C$3:$G$277,4,FALSE)+VLOOKUP($L81,#REF!,4,FALSE))","v":{"$error":"#REF!"}},{"$f":"IF(ISNA(VLOOKUP($L81,'All Individuals Day 1 (ALL)'!$C$3:$G$277,5,FALSE)+VLOOKUP($L81,#REF!,5,FALSE))=TRUE,\"\",VLOOKUP($L81,'All Individuals Day 1 (ALL)'!$C$3:$G$277,5,FALSE)+VLOOKUP($L81,#REF!,5,FALSE))","v":{"$error":"#REF!"}},{"$f":"IF(ISNA(VLOOKUP($L81,'All Individuals Day 1 (ALL)'!$C$3:$K$277,8,FALSE))=TRUE,\"\",VLOOKUP($L81,'All Individuals Day 1 (ALL)'!$C$3:$K$277,8,FALSE))","v":2},{"$f":"IF(ISNA(VLOOKUP($L81,#REF!,8,FALSE))=TRUE,\"\",VLOOKUP($L81,#REF!,8,FALSE))","v":{"$error":"#REF!"}},{"$error":"#REF!"}]
[{"$f":"VLOOKUP($B82,#REF!,2,FALSE)","v":{"$error":"#N/A"}},{"$error":"#N/A"},{"$error":"#N/A"},{"$error":"#N/A"},{"$error":"#N/A"},{"$error":"#N/A"},{"$error":"#N/A"},79,null,null,{"$error":"#REF!"},79,{"$f":"IF(ISNA(VLOOKUP($L82,'All Individuals Day 1 (ALL)'!$C$3:$G$277,4,FALSE)+VLOOKUP($L82,#REF!,4,FALSE))=TRUE,\"\",VLOOKUP($L82,'All Individuals Day 1 (ALL)'!$C$3:$G$277,4,FALSE)+VLOOKUP($L82,#REF!,4,FALSE))","v":{"$error":"#REF!"}},{"$f":"IF(ISNA(VLOOKUP($L82,'All Individuals Day 1 (ALL)'!$C$3:$G$277,5,FALSE)+VLOOKUP($L82,#REF!,5,FALSE))=TRUE,\"\",VLOOKUP($L82,'All Individuals Day 1 (ALL)'!$C$3:$G$277,5,FALSE)+VLOOKUP($L82,#REF!,5,FALSE))","v":{"$error":"#REF!"}},{"$f":"IF(ISNA(VLOOKUP($L82,'All Individuals Day 1 (ALL)'!$C$3:$K$277,8,FALSE))=TRUE,\"\",VLOOKUP($L82,'All Individuals Day 1 (ALL)'!$C$3:$K$277,8,FALSE))","v":12},{"$f":"IF(ISNA(VLOOKUP($L82,#REF!,8,FALSE))=TRUE,\"\",VLOOKUP($L82,#REF!,8,FALSE))","v":{"$error":"#REF!"}},{"$error":"#REF!"}]
[{"$f":"VLOOKUP($B83,#REF!,2,FALSE)","v":{"$error":"#N/A"}},{"$error":"#N/A"},{"$error":"#N/A"},{"$error":"#N/A"},{"$error":"#N/A"},{"$error":"#N/A"},{"$error":"#N/A"},80,null,null,{"$error":"#REF!"},80,{"$f":"IF(ISNA(VLOOKUP($L83,'All Individuals Day 1 (ALL)'!$C$3:$G$277,4,FALSE)+VLOOKUP($L83,#REF!,4,FALSE))=TRUE,\"\",VLOOKUP($L83,'All Individuals Day 1 (ALL)'!$C$3:$G$277,4,FALSE)+VLOOKUP($L83,#REF!,4,FALSE))","v":{"$error":"#REF!"}},{"$f":"IF(ISNA(VLOOKUP($L83,'All Individuals Day 1 (ALL)'!$C$3:$G$277,5,FALSE)+VLOOKUP($L83,#REF!,5,FALSE))=TRUE,\"\",VLOOKUP($L83,'All Individuals Day 1 (ALL)'!$C$3:$G$277,5,FALSE)+VLOOKUP($L83,#REF!,5,FALSE))","v":{"$error":"#REF!"}},{"$f":"IF(ISNA(VLOOKUP($L83,'All Individuals Day 1 (ALL)'!$C$3:$K$277,8,FALSE))=TRUE,\"\",VLOOKUP($L83,'All Individuals Day 1 (ALL)'!$C$3:$K$277,8,FALSE))","v":8},{"$f":"IF(ISNA(VLOOKUP($L83,#REF!,8,FALSE))=TRUE,\"\",VLOOKUP($L83,#REF!,8,FALSE))","v":{"$error":"#REF!"}},{"$error":"#REF!"}]
[{"$f":"VLOOKUP($B84,#REF!,2,FALSE)","v":{"$error":"#N/A"}},{"$error":"#N/A"},{"$error":"#N/A"},{"$error":"#N/A"},{"$error":"#N/A"},{"$error":"#N/A"},{"$error":"#N/A"},81,null,null,{"$error":"#REF!"},81,{"$f":"IF(ISNA(VLOOKUP($L84,'All Individuals Day 1 (ALL)'!$C$3:$G$277,4,FALSE)+VLOOKUP($L84,#REF!,4,FALSE))=TRUE,\"\",VLOOKUP($L84,'All Individuals Day 1 (ALL)'!$C$3:$G$277,4,FALSE)+VLOOKUP($L84,#REF!,4,FALSE))","v":{"$error":"#REF!"}},{"$f":"IF(ISNA(VLOOKUP($L84,'All Individuals Day 1 (ALL)'!$C$3:$G$277,5,FALSE)+VLOOKUP($L84,#REF!,5,FALSE))=TRUE,\"\",VLOOKUP($L84,'All Individuals Day 1 (ALL)'!$C$3:$G$277,5,FALSE)+VLOOKUP($L84,#REF!,5,FALSE))","v":{"$error":"#REF!"}},{"$f":"IF(ISNA(VLOOKUP($L84,'All Individuals Day 1 (ALL)'!$C$3:$K$277,8,FALSE))=TRUE,\"\",VLOOKUP($L84,'All Individuals Day 1 (ALL)'!$C$3:$K$277,8,FALSE))","v":5},{"$f":"IF(ISNA(VLOOKUP($L84,#REF!,8,FALSE))=TRUE,\"\",VLOOKUP($L84,#REF!,8,FALSE))","v":{"$error":"#REF!"}},{"$error":"#REF!"}]
[{"$f":"VLOOKUP($B85,#REF!,2,FALSE)","v":{"$error":"#N/A"}},{"$error":"#N/A"},{"$error":"#N/A"},{"$error":"#N/A"},{"$error":"#N/A"},{"$error":"#N/A"},{"$error":"#N/A"},82,null,null,{"$error":"#REF!"},82,{"$f":"IF(ISNA(VLOOKUP($L85,'All Individuals Day 1 (ALL)'!$C$3:$G$277,4,FALSE)+VLOOKUP($L85,#REF!,4,FALSE))=TRUE,\"\",VLOOKUP($L85,'All Individuals Day 1 (ALL)'!$C$3:$G$277,4,FALSE)+VLOOKUP($L85,#REF!,4,FALSE))","v":{"$error":"#REF!"}},{"$f":"IF(ISNA(VLOOKUP($L85,'All Individuals Day 1 (ALL)'!$C$3:$G$277,5,FALSE)+VLOOKUP($L85,#REF!,5,FALSE))=TRUE,\"\",VLOOKUP($L85,'All Individuals Day 1 (ALL)'!$C$3:$G$277,5,FALSE)+VLOOKUP($L85,#REF!,5,FALSE))","v":{"$error":"#REF!"}},{"$f":"IF(ISNA(VLOOKUP($L85,'All Individuals Day 1 (ALL)'!$C$3:$K$277,8,FALSE))=TRUE,\"\",VLOOKUP($L85,'All Individuals Day 1 (ALL)'!$C$3:$K$277,8,FALSE))","v":13},{"$f":"IF(ISNA(VLOOKUP($L85,#REF!,8,FALSE))=TRUE,\"\",VLOOKUP($L85,#REF!,8,FALSE))","v":{"$error":"#REF!"}},{"$error":"#REF!"}]
[{"$f":"VLOOKUP($B86,#REF!,2,FALSE)","v":{"$error":"#N/A"}},{"$error":"#N/A"},{"$error":"#N/A"},{"$error":"#N/A"},{"$error":"#N/A"},{"$error":"#N/A"},{"$error":"#N/A"},83,null,null,{"$error":"#REF!"},83,{"$f":"IF(ISNA(VLOOKUP($L86,'All Individuals Day 1 (ALL)'!$C$3:$G$277,4,FALSE)+VLOOKUP($L86,#REF!,4,FALSE))=TRUE,\"\",VLOOKUP($L86,'All Individuals Day 1 (ALL)'!$C$3:$G$277,4,FALSE)+VLOOKUP($L86,#REF!,4,FALSE))","v":{"$error":"#REF!"}},{"$f":"IF(ISNA(VLOOKUP($L86,'All Individuals Day 1 (ALL)'!$C$3:$G$277,5,FALSE)+VLOOKUP($L86,#REF!,5,FALSE))=TRUE,\"\",VLOOKUP($L86,'All Individuals Day 1 (ALL)'!$C$3:$G$277,5,FALSE)+VLOOKUP($L86,#REF!,5,FALSE))","v":{"$error":"#REF!"}},{"$f":"IF(ISNA(VLOOKUP($L86,'All Individuals Day 1 (ALL)'!$C$3:$K$277,8,FALSE))=TRUE,\"\",VLOOKUP($L86,'All Individuals Day 1 (ALL)'!$C$3:$K$277,8,FALSE))","v":8},{"$f":"IF(ISNA(VLOOKUP($L86,#REF!,8,FALSE))=TRUE,\"\",VLOOKUP($L86,#REF!,8,FALSE))","v":{"$error":"#REF!"}},{"$error":"#REF!"}]
[{"$f":"VLOOKUP($B87,#REF!,2,FALSE)","v":{"$error":"#N/A"}},{"$error":"#N/A"},{"$error":"#N/A"},{"$error":"#N/A"},{"$error":"#N/A"},{"$error":"#N/A"},{"$error":"#N/A"},84,null,null,{"$error":"#REF!"},84,{"$f":"IF(ISNA(VLOOKUP($L87,'All Individuals Day 1 (ALL)'!$C$3:$G$277,4,FALSE)+VLOOKUP($L87,#REF!,4,FALSE))=TRUE,\"\",VLOOKUP($L87,'All Individuals Day 1 (ALL)'!$C$3:$G$277,4,FALSE)+VLOOKUP($L87,#REF!,4,FALSE))","v":{"$error":"#REF!"}},{"$f":"IF(ISNA(VLOOKUP($L87,'All Individuals Day 1 (ALL)'!$C$3:$G$277,5,FALSE)+VLOOKUP($L87,#REF!,5,FALSE))=TRUE,\"\",VLOOKUP($L87,'All Individuals Day 1 (ALL)'!$C$3:$G$277,5,FALSE)+VLOOKUP($L87,#REF!,5,FALSE))","v":{"$error":"#REF!"}},{"$f":"IF(ISNA(VLOOKUP($L87,'All Individuals Day 1 (ALL)'!$C$3:$K$277,8,FALSE))=TRUE,\"\",VLOOKUP($L87,'All Individuals Day 1 (ALL)'!$C$3:$K$277,8,FALSE))","v":11},{"$f":"IF(ISNA(VLOOKUP($L87,#REF!,8,FALSE))=TRUE,\"\",VLOOKUP($L87,#REF!,8,FALSE))","v":{"$error":"#REF!"}},{"$error":"#REF!"}]
[{"$f":"VLOOKUP($B88,#REF!,2,FALSE)","v":{"$error":"#N/A"}},{"$error":"#N/A"},{"$error":"#N/A"},{"$error":"#N/A"},{"$error":"#N/A"},{"$error":"#N/A"},{"$error":"#N/A"},{"$f":"IF(ISERROR(H87+1)=TRUE,1,H87+1)","v":85},null,null,{"$error":"#REF!"},85,{"$f":"IF(ISNA(VLOOKUP($L88,'All Individuals Day 1 (ALL)'!$C$3:$G$277,4,FALSE)+VLOOKUP($L88,#REF!,4,FALSE))=TRUE,\"\",VLOOKUP($L88,'All Individuals Day 1 (ALL)'!$C$3:$G$277,4,FALSE)+VLOOKUP($L88,#REF!,4,FALSE))","v":{"$error":"#REF!"}},{"$f":"IF(ISNA(VLOOKUP($L88,'All Individuals Day 1 (ALL)'!$C$3:$G$277,5,FALSE)+VLOOKUP($L88,#REF!,5,FALSE))=TRUE,\"\",VLOOKUP($L88,'All Individuals Day 1 (ALL)'!$C$3:$G$277,5,FALSE)+VLOOKUP($L88,#REF!,5,FALSE))","v":{"$error":"#REF!"}},{"$f":"IF(ISNA(VLOOKUP($L88,'All Individuals Day 1 (ALL)'!$C$3:$K$277,8,FALSE))=TRUE,\"\",VLOOKUP($L88,'All Individuals Day 1 (ALL)'!$C$3:$K$277,8,FALSE))","v":12},{"$f":"IF(ISNA(VLOOKUP($L88,#REF!,8,FALSE))=TRUE,\"\",VLOOKUP($L88,#REF!,8,FALSE))","v":{"$error":"#REF!"}},{"$error":"#REF!"}]
[{"$f":"VLOOKUP($B89,#REF!,2,FALSE)","v":{"$error":"#N/A"}},{"$error":"#N/A"},{"$error":"#N/A"},{"$error":"#N/A"},{"$error":"#N/A"},{"$error":"#N/A"},{"$error":"#N/A"},86,null,null,{"$error":"#REF!"},86,{"$f":"IF(ISNA(VLOOKUP($L89,'All Individuals Day 1 (ALL)'!$C$3:$G$277,4,FALSE)+VLOOKUP($L89,#REF!,4,FALSE))=TRUE,\"\",VLOOKUP($L89,'All Individuals Day 1 (ALL)'!$C$3:$G$277,4,FALSE)+VLOOKUP($L89,#REF!,4,FALSE))","v":{"$error":"#REF!"}},{"$f":"IF(ISNA(VLOOKUP($L89,'All Individuals Day 1 (ALL)'!$C$3:$G$277,5,FALSE)+VLOOKUP($L89,#REF!,5,FALSE))=TRUE,\"\",VLOOKUP($L89,'All Individuals Day 1 (ALL)'!$C$3:$G$277,5,FALSE)+VLOOKUP($L89,#REF!,5,FALSE))","v":{"$error":"#REF!"}},{"$f":"IF(ISNA(VLOOKUP($L89,'All Individuals Day 1 (ALL)'!$C$3:$K$277,8,FALSE))=TRUE,\"\",VLOOKUP($L89,'All Individuals Day 1 (ALL)'!$C$3:$K$277,8,FALSE))","v":10},{"$f":"IF(ISNA(VLOOKUP($L89,#REF!,8,FALSE))=TRUE,\"\",VLOOKUP($L89,#REF!,8,FALSE))","v":{"$error":"#REF!"}},{"$error":"#REF!"}]
[{"$f":"VLOOKUP($B90,#REF!,2,FALSE)","v":{"$error":"#N/A"}},{"$error":"#N/A"},{"$error":"#N/A"},{"$error":"#N/A"},{"$error":"#N/A"},{"$error":"#N/A"},{"$error":"#N/A"},87,null,null,{"$error":"#REF!"},87,{"$f":"IF(ISNA(VLOOKUP($L90,'All Individuals Day 1 (ALL)'!$C$3:$G$277,4,FALSE)+VLOOKUP($L90,#REF!,4,FALSE))=TRUE,\"\",VLOOKUP($L90,'All Individuals Day 1 (ALL)'!$C$3:$G$277,4,FALSE)+VLOOKUP($L90,#REF!,4,FALSE))","v":{"$error":"#REF!"}},{"$f":"IF(ISNA(VLOOKUP($L90,'All Individuals Day 1 (ALL)'!$C$3:$G$277,5,FALSE)+VLOOKUP($L90,#REF!,5,FALSE))=TRUE,\"\",VLOOKUP($L90,'All Individuals Day 1 (ALL)'!$C$3:$G$277,5,FALSE)+VLOOKUP($L90,#REF!,5,FALSE))","v":{"$error":"#REF!"}},{"$f":"IF(ISNA(VLOOKUP($L90,'All Individuals Day 1 (ALL)'!$C$3:$K$277,8,FALSE))=TRUE,\"\",VLOOKUP($L90,'All Individuals Day 1 (ALL)'!$C$3:$K$277,8,FALSE))","v":6},{"$f":"IF(ISNA(VLOOKUP($L90,#REF!,8,FALSE))=TRUE,\"\",VLOOKUP($L90,#REF!,8,FALSE))","v":{"$error":"#REF!"}},{"$error":"#REF!"}]
[{"$f":"VLOOKUP($B91,#REF!,2,FALSE)","v":{"$error":"#N/A"}},{"$error":"#N/A"},{"$error":"#N/A"},{"$error":"#N/A"},{"$error":"#N/A"},{"$error":"#N/A"},{"$error":"#N/A"},88,null,null,{"$error":"#REF!"},88,{"$f":"IF(ISNA(VLOOKUP($L91,'All Individuals Day 1 (ALL)'!$C$3:$G$277,4,FALSE)+VLOOKUP($L91,#REF!,4,FALSE))=TRUE,\"\",VLOOKUP($L91,'All Individuals Day 1 (ALL)'!$C$3:$G$277,4,FALSE)+VLOOKUP($L91,#REF!,4,FALSE))","v":{"$error":"#REF!"}},{"$f":"IF(ISNA(VLOOKUP($L91,'All Individuals Day 1 (ALL)'!$C$3:$G$277,5,FALSE)+VLOOKUP($L91,#REF!,5,FALSE))=TRUE,\"\",VLOOKUP($L91,'All Individuals Day 1 (ALL)'!$C$3:$G$277,5,FALSE)+VLOOKUP($L91,#REF!,5,FALSE))","v":{"$error":"#REF!"}},{"$f":"IF(ISNA(VLOOKUP($L91,'All Individuals Day 1 (ALL)'!$C$3:$K$277,8,FALSE))=TRUE,\"\",VLOOKUP($L91,'All Individuals Day 1 (ALL)'!$C$3:$K$277,8,FALSE))","v":7},{"$f":"IF(ISNA(VLOOKUP($L91,#REF!,8,FALSE))=TRUE,\"\",VLOOKUP($L91,#REF!,8,FALSE))","v":{"$error":"#REF!"}},{"$error":"#REF!"}]
[{"$f":"VLOOKUP($B92,#REF!,2,FALSE)","v":{"$error":"#N/A"}},{"$error":"#N/A"},{"$error":"#N/A"},{"$error":"#N/A"},{"$error":"#N/A"},{"$error":"#N/A"},{"$error":"#N/A"},89,null,null,{"$error":"#REF!"},89,{"$f":"IF(ISNA(VLOOKUP($L92,'All Individuals Day 1 (ALL)'!$C$3:$G$277,4,FALSE)+VLOOKUP($L92,#REF!,4,FALSE))=TRUE,\"\",VLOOKUP($L92,'All Individuals Day 1 (ALL)'!$C$3:$G$277,4,FALSE)+VLOOKUP($L92,#REF!,4,FALSE))","v":{"$error":"#REF!"}},{"$f":"IF(ISNA(VLOOKUP($L92,'All Individuals Day 1 (ALL)'!$C$3:$G$277,5,FALSE)+VLOOKUP($L92,#REF!,5,FALSE))=TRUE,\"\",VLOOKUP($L92,'All Individuals Day 1 (ALL)'!$C$3:$G$277,5,FALSE)+VLOOKUP($L92,#REF!,5,FALSE))","v":{"$error":"#REF!"}},{"$f":"IF(ISNA(VLOOKUP($L92,'All Individuals Day 1 (ALL)'!$C$3:$K$277,8,FALSE))=TRUE,\"\",VLOOKUP($L92,'All Individuals Day 1 (ALL)'!$C$3:$K$277,8,FALSE))","v":3},{"$f":"IF(ISNA(VLOOKUP($L92,#REF!,8,FALSE))=TRUE,\"\",VLOOKUP($L92,#REF!,8,FALSE))","v":{"$error":"#REF!"}},{"$error":"#REF!"}]
[{"$f":"VLOOKUP($B93,#REF!,2,FALSE)","v":{"$error":"#N/A"}},{"$error":"#N/A"},{"$error":"#N/A"},{"$error":"#N/A"},{"$error":"#N/A"},{"$error":"#N/A"},{"$error":"#N/A"},90,null,null,{"$error":"#REF!"},90,{"$f":"IF(ISNA(VLOOKUP($L93,'All Individuals Day 1 (ALL)'!$C$3:$G$277,4,FALSE)+VLOOKUP($L93,#REF!,4,FALSE))=TRUE,\"\",VLOOKUP($L93,'All Individuals Day 1 (ALL)'!$C$3:$G$277,4,FALSE)+VLOOKUP($L93,#REF!,4,FALSE))","v":{"$error":"#REF!"}},{"$f":"IF(ISNA(VLOOKUP($L93,'All Individuals Day 1 (ALL)'!$C$3:$G$277,5,FALSE)+VLOOKUP($L93,#REF!,5,FALSE))=TRUE,\"\",VLOOKUP($L93,'All Individuals Day 1 (ALL)'!$C$3:$G$277,5,FALSE)+VLOOKUP($L93,#REF!,5,FALSE))","v":{"$error":"#REF!"}},{"$f":"IF(ISNA(VLOOKUP($L93,'All Individuals Day 1 (ALL)'!$C$3:$K$277,8,FALSE))=TRUE,\"\",VLOOKUP($L93,'All Individuals Day 1 (ALL)'!$C$3:$K$277,8,FALSE))","v":10},{"$f":"IF(ISNA(VLOOKUP($L93,#REF!,8,FALSE))=TRUE,\"\",VLOOKUP($L93,#REF!,8,FALSE))","v":{"$error":"#REF!"}},{"$error":"#REF!"}]
[{"$f":"VLOOKUP($B94,#REF!,2,FALSE)","v":{"$error":"#N/A"}},{"$error":"#N/A"},{"$error":"#N/A"},{"$error":"#N/A"},{"$error":"#N/A"},{"$error":"#N/A"},{"$error":"#N/A"},91,null,null,{"$error":"#REF!"},91,{"$f":"IF(ISNA(VLOOKUP($L94,'All Individuals Day 1 (ALL)'!$C$3:$G$277,4,FALSE)+VLOOKUP($L94,#REF!,4,FALSE))=TRUE,\"\",VLOOKUP($L94,'All Individuals Day 1 (ALL)'!$C$3:$G$277,4,FALSE)+VLOOKUP($L94,#REF!,4,FALSE))","v":{"$error":"#REF!"}},{"$f":"IF(ISNA(VLOOKUP($L94,'All Individuals Day 1 (ALL)'!$C$3:$G$277,5,FALSE)+VLOOKUP($L94,#REF!,5,FALSE))=TRUE,\"\",VLOOKUP($L94,'All Individuals Day 1 (ALL)'!$C$3:$G$277,5,FALSE)+VLOOKUP($L94,#REF!,5,FALSE))","v":{"$error":"#REF!"}},{"$f":"IF(ISNA(VLOOKUP($L94,'All Individuals Day 1 (ALL)'!$C$3:$K$277,8,FALSE))=TRUE,\"\",VLOOKUP($L94,'All Individuals Day 1 (ALL)'!$C$3:$K$277,8,FALSE))","v":10},{"$f":"IF(ISNA(VLOOKUP($L94,#REF!,8,FALSE))=TRUE,\"\",VLOOKUP($L94,#REF!,8,FALSE))","v":{"$error":"#REF!"}},{"$error":"#REF!"}]
[{"$f":"VLOOKUP($B95,#REF!,2,FALSE)","v":{"$error":"#N/A"}},{"$error":"#N/A"},{"$error":"#N/A"},{"$error":"#N/A"},{"$error":"#N/A"},{"$error":"#N/A"},{"$error":"#N/A"},92,null,null,{"$error":"#REF!"},92,{"$f":"IF(ISNA(VLOOKUP($L95,'All Individuals Day 1 (ALL)'!$C$3:$G$277,4,FALSE)+VLOOKUP($L95,#REF!,4,FALSE))=TRUE,\"\",VLOOKUP($L95,'All Individuals Day 1 (ALL)'!$C$3:$G$277,4,FALSE)+VLOOKUP($L95,#REF!,4,FALSE))","v":{"$error":"#REF!"}},{"$f":"IF(ISNA(VLOOKUP($L95,'All Individuals Day 1 (ALL)'!$C$3:$G$277,5,FALSE)+VLOOKUP($L95,#REF!,5,FALSE))=TRUE,\"\",VLOOKUP($L95,'All Individuals Day 1 (ALL)'!$C$3:$G$277,5,FALSE)+VLOOKUP($L95,#REF!,5,FALSE))","v":{"$error":"#REF!"}},{"$f":"IF(ISNA(VLOOKUP($L95,'All Individuals Day 1 (ALL)'!$C$3:$K$277,8,FALSE))=TRUE,\"\",VLOOKUP($L95,'All Individuals Day 1 (ALL)'!$C$3:$K$277,8,FALSE))","v":6},{"$f":"IF(ISNA(VLOOKUP($L95,#REF!,8,FALSE))=TRUE,\"\",VLOOKUP($L95,#REF!,8,FALSE))","v":{"$error":"#REF!"}},{"$error":"#REF!"}]
[{"$f":"VLOOKUP($B96,#REF!,2,FALSE)","v":{"$error":"#N/A"}},{"$error":"#N/A"},{"$error":"#N/A"},{"$error":"#N/A"},{"$error":"#N/A"},{"$error":"#N/A"},{"$error":"#N/A"},93,null,null,{"$error":"#REF!"},93,{"$f":"IF(ISNA(VLOOKUP($L96,'All Individuals Day 1 (ALL)'!$C$3:$G$277,4,FALSE)+VLOOKUP($L96,#REF!,4,FALSE))=TRUE,\"\",VLOOKUP($L96,'All Individuals Day 1 (ALL)'!$C$3:$G$277,4,FALSE)+VLOOKUP($L96,#REF!,4,FALSE))","v":{"$error":"#REF!"}},{"$f":"IF(ISNA(VLOOKUP($L96,'All Individuals Day 1 (ALL)'!$C$3:$G$277,5,FALSE)+VLOOKUP($L96,#REF!,5,FALSE))=TRUE,\"\",VLOOKUP($L96,'All Individuals Day 1 (ALL)'!$C$3:$G$277,5,FALSE)+VLOOKUP($L96,#REF!,5,FALSE))","v":{"$error":"#REF!"}},{"$f":"IF(ISNA(VLOOKUP($L96,'All Individuals Day 1 (ALL)'!$C$3:$K$277,8,FALSE))=TRUE,\"\",VLOOKUP($L96,'All Individuals Day 1 (ALL)'!$C$3:$K$277,8,FALSE))","v":7},{"$f":"IF(ISNA(VLOOKUP($L96,#REF!,8,FALSE))=TRUE,\"\",VLOOKUP($L96,#REF!,8,FALSE))","v":{"$error":"#REF!"}},{"$error":"#REF!"}]
[{"$f":"VLOOKUP($B97,#REF!,2,FALSE)","v":{"$error":"#N/A"}},{"$error":"#N/A"},{"$error":"#N/A"},{"$error":"#N/A"},{"$error":"#N/A"},{"$error":"#N/A"},{"$error":"#N/A"},94,null,null,{"$error":"#REF!"},94,{"$f":"IF(ISNA(VLOOKUP($L97,'All Individuals Day 1 (ALL)'!$C$3:$G$277,4,FALSE)+VLOOKUP($L97,#REF!,4,FALSE))=TRUE,\"\",VLOOKUP($L97,'All Individuals Day 1 (ALL)'!$C$3:$G$277,4,FALSE)+VLOOKUP($L97,#REF!,4,FALSE))","v":{"$error":"#REF!"}},{"$f":"IF(ISNA(VLOOKUP($L97,'All Individuals Day 1 (ALL)'!$C$3:$G$277,5,FALSE)+VLOOKUP($L97,#REF!,5,FALSE))=TRUE,\"\",VLOOKUP($L97,'All Individuals Day 1 (ALL)'!$C$3:$G$277,5,FALSE)+VLOOKUP($L97,#REF!,5,FALSE))","v":{"$error":"#REF!"}},{"$f":"IF(ISNA(VLOOKUP($L97,'All Individuals Day 1 (ALL)'!$C$3:$K$277,8,FALSE))=TRUE,\"\",VLOOKUP($L97,'All Individuals Day 1 (ALL)'!$C$3:$K$277,8,FALSE))","v":5},{"$f":"IF(ISNA(VLOOKUP($L97,#REF!,8,FALSE))=TRUE,\"\",VLOOKUP($L97,#REF!,8,FALSE))","v":{"$error":"#REF!"}},{"$error":"#REF!"}]
[{"$f":"VLOOKUP($B98,#REF!,2,FALSE)","v":{"$error":"#N/A"}},{"$error":"#N/A"},{"$error":"#N/A"},{"$error":"#N/A"},{"$error":"#N/A"},{"$error":"#N/A"},{"$error":"#N/A"},95,null,null,{"$error":"#REF!"},95,{"$f":"IF(ISNA(VLOOKUP($L98,'All Individuals Day 1 (ALL)'!$C$3:$G$277,4,FALSE)+VLOOKUP($L98,#REF!,4,FALSE))=TRUE,\"\",VLOOKUP($L98,'All Individuals Day 1 (ALL)'!$C$3:$G$277,4,FALSE)+VLOOKUP($L98,#REF!,4,FALSE))","v":{"$error":"#REF!"}},{"$f":"IF(ISNA(VLOOKUP($L98,'All Individuals Day 1 (ALL)'!$C$3:$G$277,5,FALSE)+VLOOKUP($L98,#REF!,5,FALSE))=TRUE,\"\",VLOOKUP($L98,'All Individuals Day 1 (ALL)'!$C$3:$G$277,5,FALSE)+VLOOKUP($L98,#REF!,5,FALSE))","v":{"$error":"#REF!"}},{"$f":"IF(ISNA(VLOOKUP($L98,'All Individuals Day 1 (ALL)'!$C$3:$K$277,8,FALSE))=TRUE,\"\",VLOOKUP($L98,'All Individuals Day 1 (ALL)'!$C$3:$K$277,8,FALSE))","v":1},{"$f":"IF(ISNA(VLOOKUP($L98,#REF!,8,FALSE))=TRUE,\"\",VLOOKUP($L98,#REF!,8,FALSE))","v":{"$error":"#REF!"}},{"$error":"#REF!"}]
[{"$f":"VLOOKUP($B99,#REF!,2,FALSE)","v":{"$error":"#N/A"}},{"$error":"#N/A"},{"$error":"#N/A"},{"$error":"#N/A"},{"$error":"#N/A"},{"$error":"#N/A"},{"$error":"#N/A"},96,null,null,{"$error":"#REF!"},96,{"$f":"IF(ISNA(VLOOKUP($L99,'All Individuals Day 1 (ALL)'!$C$3:$G$277,4,FALSE)+VLOOKUP($L99,#REF!,4,FALSE))=TRUE,\"\",VLOOKUP($L99,'All Individuals Day 1 (ALL)'!$C$3:$G$277,4,FALSE)+VLOOKUP($L99,#REF!,4,FALSE))","v":{"$error":"#REF!"}},{"$f":"IF(ISNA(VLOOKUP($L99,'All Individuals Day 1 (ALL)'!$C$3:$G$277,5,FALSE)+VLOOKUP($L99,#REF!,5,FALSE))=TRUE,\"\",VLOOKUP($L99,'All Individuals Day 1 (ALL)'!$C$3:$G$277,5,FALSE)+VLOOKUP($L99,#REF!,5,FALSE))","v":{"$error":"#REF!"}},{"$f":"IF(ISNA(VLOOKUP($L99,'All Individuals Day 1 (ALL)'!$C$3:$K$277,8,FALSE))=TRUE,\"\",VLOOKUP($L99,'All Individuals Day 1 (ALL)'!$C$3:$K$277,8,FALSE))","v":2},{"$f":"IF(ISNA(VLOOKUP($L99,#REF!,8,FALSE))=TRUE,\"\",VLOOKUP($L99,#REF!,8,FALSE))","v":{"$error":"#REF!"}},{"$error":"#REF!"}]
[{"$f":"VLOOKUP($B100,#REF!,2,FALSE)","v":{"$error":"#N/A"}},{"$error":"#N/A"},{"$error":"#N/A"},{"$error":"#N/A"},{"$error":"#N/A"},{"$error":"#N/A"},{"$error":"#N/A"},97,null,null,{"$error":"#REF!"},97,{"$f":"IF(ISNA(VLOOKUP($L100,'All Individuals Day 1 (ALL)'!$C$3:$G$277,4,FALSE)+VLOOKUP($L100,#REF!,4,FALSE))=TRUE,\"\",VLOOKUP($L100,'All Individuals Day 1 (ALL)'!$C$3:$G$277,4,FALSE)+VLOOKUP($L100,#REF!,4,FALSE))","v":{"$error":"#REF!"}},{"$f":"IF(ISNA(VLOOKUP($L100,'All Individuals Day 1 (ALL)'!$C$3:$G$277,5,FALSE)+VLOOKUP($L100,#REF!,5,FALSE))=TRUE,\"\",VLOOKUP($L100,'All Individuals Day 1 (ALL)'!$C$3:$G$277,5,FALSE)+VLOOKUP($L100,#REF!,5,FALSE))","v":{"$error":"#REF!"}},{"$f":"IF(ISNA(VLOOKUP($L100,'All Individuals Day 1 (ALL)'!$C$3:$K$277,8,FALSE))=TRUE,\"\",VLOOKUP($L100,'All Individuals Day 1 (ALL)'!$C$3:$K$277,8,FALSE))","v":1},{"$f":"IF(ISNA(VLOOKUP($L100,#REF!,8,FALSE))=TRUE,\"\",VLOOKUP($L100,#REF!,8,FALSE))","v":{"$error":"#REF!"}},{"$f":"IF(OR(M100=\"\",M100=0),NpZ*2,(O100+P100)-N100/100000-M100/1000000)","v":{"$error":"#REF!"}}]
[{"$f":"VLOOKUP($B101,#REF!,2,FALSE)","v":{"$error":"#N/A"}},{"$error":"#N/A"},{"$error":"#N/A"},{"$error":"#N/A"},{"$error":"#N/A"},{"$error":"#N/A"},{"$error":"#N/A"},98,null,null,{"$error":"#REF!"},98,{"$f":"IF(ISNA(VLOOKUP($L101,'All Individuals Day 1 (ALL)'!$C$3:$G$277,4,FALSE)+VLOOKUP($L101,#REF!,4,FALSE))=TRUE,\"\",VLOOKUP($L101,'All Individuals Day 1 (ALL)'!$C$3:$G$277,4,FALSE)+VLOOKUP($L101,#REF!,4,FALSE))","v":{"$error":"#REF!"}},{"$f":"IF(ISNA(VLOOKUP($L101,'All Individuals Day 1 (ALL)'!$C$3:$G$277,5,FALSE)+VLOOKUP($L101,#REF!,5,FALSE))=TRUE,\"\",VLOOKUP($L101,'All Individuals Day 1 (ALL)'!$C$3:$G$277,5,FALSE)+VLOOKUP($L101,#REF!,5,FALSE))","v":{"$error":"#REF!"}},{"$f":"IF(ISNA(VLOOKUP($L101,'All Individuals Day 1 (ALL)'!$C$3:$K$277,8,FALSE))=TRUE,\"\",VLOOKUP($L101,'All Individuals Day 1 (ALL)'!$C$3:$K$277,8,FALSE))","v":1},{"$f":"IF(ISNA(VLOOKUP($L101,#REF!,8,FALSE))=TRUE,\"\",VLOOKUP($L101,#REF!,8,FALSE))","v":{"$error":"#REF!"}},{"$f":"IF(OR(M101=\"\",M101=0),NpZ*2,(O101+P101)-N101/100000-M101/1000000)","v":{"$error":"#REF!"}}]
[{"$f":"VLOOKUP($B102,#REF!,2,FALSE)","v":{"$error":"#N/A"}},{"$error":"#N/A"},{"$error":"#N/A"},{"$error":"#N/A"},{"$error":"#N/A"},{"$error":"#N/A"},{"$error":"#N/A"},99,null,null,{"$error":"#REF!"},99,{"$f":"IF(ISNA(VLOOKUP($L102,'All Individuals Day 1 (ALL)'!$C$3:$G$277,4,FALSE)+VLOOKUP($L102,#REF!,4,FALSE))=TRUE,\"\",VLOOKUP($L102,'All Individuals Day 1 (ALL)'!$C$3:$G$277,4,FALSE)+VLOOKUP($L102,#REF!,4,FALSE))","v":{"$error":"#REF!"}},{"$f":"IF(ISNA(VLOOKUP($L102,'All Individuals Day 1 (ALL)'!$C$3:$G$277,5,FALSE)+VLOOKUP($L102,#REF!,5,FALSE))=TRUE,\"\",VLOOKUP($L102,'All Individuals Day 1 (ALL)'!$C$3:$G$277,5,FALSE)+VLOOKUP($L102,#REF!,5,FALSE))","v":{"$error":"#REF!"}},{"$f":"IF(ISNA(VLOOKUP($L102,'All Individuals Day 1 (ALL)'!$C$3:$K$277,8,FALSE))=TRUE,\"\",VLOOKUP($L102,'All Individuals Day 1 (ALL)'!$C$3:$K$277,8,FALSE))","v":3},{"$f":"IF(ISNA(VLOOKUP($L102,#REF!,8,FALSE))=TRUE,\"\",VLOOKUP($L102,#REF!,8,FALSE))","v":{"$error":"#REF!"}},{"$f":"IF(OR(M102=\"\",M102=0),NpZ*2,(O102+P102)-N102/100000-M102/1000000)","v":{"$error":"#REF!"}}]
[{"$f":"VLOOKUP($B103,#REF!,2,FALSE)","v":{"$error":"#N/A"}},{"$error":"#N/A"},{"$error":"#N/A"},{"$error":"#N/A"},{"$error":"#N/A"},{"$error":"#N/A"},{"$error":"#N/A"},100,null,null,{"$error":"#REF!"},100,{"$f":"IF(ISNA(VLOOKUP($L103,'All Individuals Day 1 (ALL)'!$C$3:$G$277,4,FALSE)+VLOOKUP($L103,#REF!,4,FALSE))=TRUE,\"\",VLOOKUP($L103,'All Individuals Day 1 (ALL)'!$C$3:$G$277,4,FALSE)+VLOOKUP($L103,#REF!,4,FALSE))","v":{"$error":"#REF!"}},{"$f":"IF(ISNA(VLOOKUP($L103,'All Individuals Day 1 (ALL)'!$C$3:$G$277,5,FALSE)+VLOOKUP($L103,#REF!,5,FALSE))=TRUE,\"\",VLOOKUP($L103,'All Individuals Day 1 (ALL)'!$C$3:$G$277,5,FALSE)+VLOOKUP($L103,#REF!,5,FALSE))","v":{"$error":"#REF!"}},{"$f":"IF(ISNA(VLOOKUP($L103,'All Individuals Day 1 (ALL)'!$C$3:$K$277,8,FALSE))=TRUE,\"\",VLOOKUP($L103,'All Individuals Day 1 (ALL)'!$C$3:$K$277,8,FALSE))","v":14},{"$f":"IF(ISNA(VLOOKUP($L103,#REF!,8,FALSE))=TRUE,\"\",VLOOKUP($L103,#REF!,8,FALSE))","v":{"$error":"#REF!"}},{"$f":"IF(OR(M103=\"\",M103=0),NpZ*2,(O103+P103)-N103/100000-M103/1000000)","v":{"$error":"#REF!"}}]

{"sheet":"Weight Point Table (qtr oz)","index":31,"n_rows":671,"n_cols":4,"rows_kept":671,"cut":false,"hidden":true,"merged":[]}
["Species","Length","Lookup","Weight Points"]
["b",18,{"$f":"CONCATENATE(A2,B2)","v":"b18"},10]
["b",19,{"$f":"CONCATENATE(A3,B3)","v":"b19"},13]
["b",20,"b20",14]
["b",21,"b21",15]
["b",22,"b22",16]
["b",23,"b23",18]
["b",24,"b24",20]
["b",25,"b25",24]
["b",26,"b26",28]
["b",27,"b27",32]
["b",28,"b28",38]
["b",29,"b29",40]
["b",30,"b30",44]
["b",31,"b31",48]
["b",32,"b32",52]
["b",33,"b33",56]
["b",34,"b34",64]
["b",35,"b35",68]
["b",36,"b36",76]
["b",37,"b37",80]
["b",38,"b38",84]
["b",39,"b39",88]
["b",40,"b40",92]
["b",41,"b41",96]
["b",42,"b42",104]
["b",43,"b43",112]
["b",44,"b44",120]
["c",18,"c18",10]
["c",19,"c19",13]
["c",20,"c20",14]
["c",21,"c21",15]
["c",22,"c22",16]
["c",23,"c23",18]
["c",24,"c24",20]
["c",25,"c25",24]
["c",26,"c26",28]
["c",27,"c27",32]
["c",28,"c28",38]
["c",29,"c29",40]
["c",30,"c30",44]
["c",31,"c31",48]
["c",32,"c32",52]
["c",33,"c33",56]
["c",34,"c34",64]
["c",35,"c35",68]
["c",36,"c36",76]
["c",37,"c37",80]
["c",38,"c38",84]
["c",39,"c39",88]
["c",40,"c40",92]
["c",41,"c41",96]
["c",42,"c42",104]
["c",43,"c43",112]
["c",44,"c44",120]
["p",18,"p18",10]
["p",19,"p19",13]
["p",20,"p20",14]
["p",21,"p21",15]
["p",22,"p22",16]
["p",23,"p23",18]
["p",24,"p24",20]
["p",25,"p25",24]
["p",26,"p26",28]
["p",27,"p27",32]
["p",28,"p28",38]
["p",29,{"$f":"CONCATENATE(A67,B67)","v":"p29"},40]
["p",30,"p30",44]
["p",31,"p31",48]
["p",32,"p32",52]
["p",33,"p33",56]
["p",34,"p34",64]
["p",35,"p35",68]
["p",36,"p36",76]
["p",37,"p37",80]
["p",38,"p38",84]
["p",39,"p39",88]
["p",40,"p40",92]
["p",41,"p41",96]
["p",42,"p42",104]
["p",43,"p43",112]
["p",44,"p44",120]
["g",18,"g18",10]
["g",19,"g19",13]
["g",20,"g20",14]
["g",21,"g21",15]
["g",22,"g22",16]
["g",23,"g23",18]
["g",24,"g24",20]
["g",25,"g25",24]
["g",26,"g26",28]
["g",27,"g27",32]
["g",28,"g28",38]
["g",29,"g29",40]
["g",30,"g30",44]
["g",31,"g31",48]
["g",32,"g32",52]
["g",33,"g33",56]
["g",34,"g34",64]
["g",35,"g35",68]
["g",36,"g36",76]
["g",37,"g37",80]
["g",38,"g38",84]
["g",39,"g39",88]
["g",40,"g40",92]
["g",41,"g41",96]
["g",42,"g42",104]
["g",43,"g43",112]
["g",44,"g44",120]
["m",18,"m18",10]
["m",19,"m19",13]
["m",20,"m20",14]
["m",21,"m21",15]
["m",22,"m22",16]
["m",23,"m23",18]
["m",24,"m24",20]
["m",25,"m25",24]
["m",26,"m26",28]
["m",27,"m27",32]
["m",28,"m28",38]
["m",29,"m29",40]
["m",30,"m30",44]
["m",31,"m31",48]
["m",32,"m32",52]
["m",33,"m33",56]
["m",34,"m34",64]
["m",35,"m35",68]
["m",36,"m36",76]
["m",37,"m37",80]
["m",38,"m38",84]
["m",39,{"$f":"CONCATENATE(A131,B131)","v":"m39"},88]
["m",40,"m40",92]
["m",41,"m41",96]
["m",42,"m42",104]
["m",43,"m43",112]
["m",44,"m44",120]
["sc",18,"sc18",10]
["sc",19,"sc19",13]
["sc",20,"sc20",14]
["sc",21,"sc21",15]
["sc",22,"sc22",16]
["sc",23,"sc23",18]
["sc",24,"sc24",20]
["sc",25,"sc25",24]
["sc",26,"sc26",28]
["sc",27,"sc27",32]
["sc",28,"sc28",38]
["sc",29,"sc29",40]
["sc",30,"sc30",44]
["sc",31,"sc31",48]
["sc",32,"sc32",52]
["sc",33,"sc33",56]
["sc",34,"sc34",64]
["sc",35,"sc35",68]
["sc",36,"sc36",76]
["sc",37,"sc37",80]
["sc",38,"sc38",84]
["sc",39,"sc39",88]
["sc",40,"sc40",92]
["sc",41,"sc41",96]
["sc",42,"sc42",104]
["sc",43,"sc43",112]
["sc",44,"sc44",120]
["db",18,"db18",8]
["db",19,"db19",10]
["db",20,"db20",11]
["db",21,"db21",12]
["db",22,"db22",14]
["db",23,"db23",16]
["db",24,"db24",18]
["db",25,"db25",20]
["db",26,"db26",24]
["db",27,"db27",28]
["db",28,"db28",32]
["db",29,"db29",40]
["db",30,"db30",48]
["db",31,"db31",56]
["db",32,"db32",60]
["db",33,"db33",64]
["db",34,"db34",68]
["db",35,"db35",72]
["db",36,"db36",76]
["db",37,"db37",80]
["db",38,"db38",88]
["db",39,"db39",96]
["db",40,"db40",104]
["db",41,"db41",112]
["db",42,"db42",124]
["db",43,"db43",136]
["db",44,"db44",148]
["f",18,"f18",8]
["f",19,"f19",10]
["f",20,"f20",11]
["f",21,"f21",12]
["f",22,{"$f":"CONCATENATE(A195,B195)","v":"f22"},14]
["f",23,"f23",16]
["f",24,"f24",18]
["f",25,"f25",20]
["f",26,"f26",24]
["f",27,"f27",28]
["f",28,"f28",32]
["f",29,"f29",40]
["f",30,"f30",48]
["f",31,"f31",56]
["f",32,"f32",60]
["f",33,"f33",64]
["f",34,"f34",68]
["f",35,"f35",72]
["f",36,"f36",76]
["f",37,"f37",80]
["f",38,"f38",88]
["f",39,"f39",96]
["f",40,"f40",104]
["f",41,"f41",112]
["f",42,"f42",124]
["f",43,"f43",136]
["f",44,"f44",148]
["s",18,"s18",8]
["s",19,"s19",10]
["s",20,"s20",11]
["s",21,"s21",12]
["s",22,"s22",14]
["s",23,"s23",16]
["s",24,"s24",18]
["s",25,"s25",20]
["s",26,"s26",24]
["s",27,"s27",28]
["s",28,"s28",32]
["s",29,"s29",40]
["s",30,"s30",48]
["s",31,"s31",56]
["s",32,"s32",60]
["s",33,"s33",64]
["s",34,"s34",68]
["s",35,"s35",72]
["s",36,"s36",76]
["s",37,"s37",80]
["s",38,"s38",88]
["s",39,"s39",96]
["s",40,"s40",104]
["s",41,"s41",112]
["s",42,"s42",124]
["s",43,"s43",136]
["s",44,"s44",148]
["p",18,"p18",8]
["p",19,"p19",10]
["p",20,"p20",11]
["p",21,"p21",12]
["p",22,"p22",14]
["p",23,"p23",16]
["p",24,"p24",18]
["p",25,"p25",20]
["p",26,"p26",24]
["p",27,"p27",28]
["p",28,"p28",32]
["p",29,"p29",40]
["p",30,"p30",48]
["p",31,"p31",56]
["p",32,{"$f":"CONCATENATE(A259,B259)","v":"p32"},60]
["p",33,"p33",64]
["p",34,"p34",68]
["p",35,"p35",72]
["p",36,"p36",76]
["p",37,"p37",80]
["p",38,"p38",88]
["p",39,"p39",96]
["p",40,"p40",104]
["p",41,"p41",112]
["p",42,"p42",124]
["p",43,"p43",136]
["p",44,"p44",148]
["r",18,"r18",8]
["r",19,"r19",10]
["r",20,"r20",11]
["r",21,"r21",12]
["r",22,"r22",14]
["r",23,"r23",16]
["r",24,"r24",18]
["r",25,"r25",20]
["r",26,"r26",24]
["r",27,"r27",28]
["r",28,"r28",32]
["r",29,"r29",40]
["r",30,"r30",48]
["r",31,"r31",56]
["r",32,"r32",60]
["r",33,"r33",64]
["r",34,"r34",68]
["r",35,"r35",72]
["r",36,"r36",76]
["r",37,"r37",80]
["r",38,"r38",88]
["r",39,"r39",96]
["r",40,"r40",104]
["r",41,"r41",112]
["r",42,"r42",124]
["r",43,"r43",136]
["r",44,"r44",148]
["ro",18,"ro18",8]
["ro",19,"ro19",10]
["ro",20,"ro20",11]
["ro",21,"ro21",12]
["ro",22,"ro22",13]
["ro",23,"ro23",14]
["ro",24,"ro24",15]
["ro",25,"ro25",16]
["ro",26,"ro26",18]
["ro",27,"ro27",20]
["ro",28,"ro28",24]
["ro",29,"ro29",28]
["ro",30,"ro30",32]
["ro",31,"ro31",36]
["ro",32,"ro32",40]
["ro",33,"ro33",44]
["ro",34,"ro34",48]
["ro",35,"ro35",52]
["ro",36,"ro36",54]
["ro",37,"ro37",56]
["ro",38,"ro38",64]
["ro",39,"ro39",68]
["ro",40,"ro40",72]
["ro",41,"ro41",76]
["ro",42,{"$f":"CONCATENATE(A323,B323)","v":"ro42"},80]
["ro",43,"ro43",84]
["ro",44,"ro44",88]
["w",18,"w18",8]
["w",19,"w19",10]
["w",20,"w20",11]
["w",21,"w21",12]
["w",22,"w22",13]
["w",23,"w23",14]
["w",24,"w24",15]
["w",25,"w25",16]
["w",26,"w26",18]
["w",27,"w27",20]
["w",28,"w28",24]
["w",29,"w29",28]
["w",30,"w30",32]
["w",31,"w31",36]
["w",32,"w32",40]
["w",33,"w33",44]
["w",34,"w34",48]
["w",35,"w35",52]
["w",36,"w36",54]
["w",37,"w37",56]
["w",38,"w38",64]
["w",39,"w39",68]
["w",40,"w40",72]
["w",41,"w41",76]
["w",42,"w42",80]
["w",43,"w43",84]
["w",44,"w44",88]
["u",18,"u18",8]
["u",19,"u19",10]
["u",20,"u20",11]
["u",21,"u21",12]
["u",22,"u22",13]
["u",23,"u23",14]
["u",24,"u24",15]
["u",25,"u25",16]
["u",26,"u26",18]
["u",27,"u27",20]
["u",28,"u28",24]
["u",29,"u29",28]
["u",30,"u30",32]
["u",31,"u31",36]
["u",32,"u32",40]
["u",33,"u33",44]
["u",34,"u34",48]
["u",35,"u35",52]
["u",36,"u36",54]
["u",37,"u37",56]
["u",38,"u38",64]
["u",39,"u39",68]
["u",40,"u40",72]
["u",41,"u41",76]
["u",42,"u42",80]
["u",43,"u43",84]
["u",44,"u44",88]
["co",18,"co18",8]
["co",19,"co19",10]
["co",20,"co20",11]
["co",21,"co21",12]
["co",22,"co22",13]
["co",23,"co23",14]
["co",24,"co24",15]
["co",25,{"$f":"CONCATENATE(A387,B387)","v":"co25"},16]
["co",26,"co26",18]
["co",27,"co27",20]
["co",28,"co28",24]
["co",29,"co29",28]
["co",30,"co30",32]
["co",31,"co31",36]
["co",32,"co32",40]
["co",33,"co33",44]
["co",34,"co34",48]
["co",35,"co35",52]
["co",36,"co36",54]
["co",37,"co37",56]
["co",38,"co38",64]
["co",39,"co39",68]
["co",40,"co40",72]
["co",41,"co41",76]
["co",42,"co42",80]
["co",43,"co43",84]
["co",44,"co44",88]
["pc",18,"pc18",8]
["pc",19,"pc19",10]
["pc",20,"pc20",11]
["pc",21,"pc21",12]
["pc",22,"pc22",13]
["pc",23,"pc23",14]
["pc",24,"pc24",15]
["pc",25,"pc25",16]
["pc",26,"pc26",18]
["pc",27,"pc27",20]
["pc",28,"pc28",24]
["pc",29,"pc29",28]
["pc",30,"pc30",32]
["pc",31,"pc31",36]
["pc",32,"pc32",40]
["pc",33,"pc33",44]
["pc",34,"pc34",48]
["pc",35,"pc35",52]
["pc",36,"pc36",54]
["pc",37,"pc37",56]
["pc",38,"pc38",64]
["pc",39,"pc39",68]
["pc",40,"pc40",72]
["pc",41,"pc41",76]
["pc",42,"pc42",80]
["pc",43,"pc43",84]
["pc",44,"pc44",88]
["po",18,"po18",8]
["po",19,"po19",10]
["po",20,"po20",11]
["po",21,"po21",12]
["po",22,"po22",13]
["po",23,"po23",14]
["po",24,"po24",15]
["po",25,"po25",16]
["po",26,"po26",18]
["po",27,"po27",20]
["po",28,"po28",24]
["po",29,"po29",28]
["po",30,"po30",32]
["po",31,"po31",36]
["po",32,"po32",40]
["po",33,"po33",44]
["po",34,"po34",48]
["po",35,{"$f":"CONCATENATE(A451,B451)","v":"po35"},52]
["po",36,"po36",54]
["po",37,"po37",56]
["po",38,"po38",64]
["po",39,"po39",68]
["po",40,"po40",72]
["po",41,"po41",76]
["po",42,"po42",80]
["po",43,"po43",84]
["po",44,"po44",88]
["b",18,"b18",10]
["b",19,"b19",12]
["b",20,"b20",15]
["b",21,"b21",18]
["b",22,"b22",20]
["b",23,"b23",24]
["b",24,"b24",28]
["b",25,"b25",32]
["b",26,"b26",36]
["b",27,"b27",44]
["b",28,"b28",48]
["b",29,"b29",56]
["b",30,"b30",64]
["b",31,"b31",68]
["b",32,"b32",72]
["b",33,"b33",84]
["b",34,"b34",96]
["b",35,"b35",104]
["b",36,"b36",112]
["b",37,"b37",120]
["b",38,"b38",128]
["b",39,"b39",136]
["b",40,"b40",144]
["b",41,"b41",152]
["b",42,"b42",160]
["b",43,"b43",164]
["b",44,"b44",168]
["w",18,"w18",10]
["w",19,"w19",12]
["w",20,"w20",15]
["w",21,"w21",18]
["w",22,"w22",20]
["w",23,"w23",24]
["w",24,"w24",28]
["w",25,"w25",32]
["w",26,"w26",36]
["w",27,"w27",44]
["w",28,"w28",48]
["w",29,"w29",56]
["w",30,"w30",64]
["w",31,"w31",68]
["w",32,"w32",72]
["w",33,"w33",84]
["w",34,"w34",96]
["w",35,"w35",104]
["w",36,"w36",112]
["w",37,"w37",120]
["w",38,"w38",128]
["w",39,"w39",136]
["w",40,"w40",144]
["w",41,"w41",152]
["w",42,"w42",160]
["w",43,"w43",164]
["w",44,"w44",168]
["sh",18,{"$f":"CONCATENATE(A515,B515)","v":"sh18"},32]
["sh",19,"sh19",32]
["sh",20,"sh20",32]
["sh",21,"sh21",32]
["sh",22,"sh22",32]
["sh",23,"sh23",32]
["sh",24,{"$f":"CONCATENATE(A521,B521)","v":"sh24"},32]
["sh",25,"sh25",32]
["sh",26,"sh26",32]
["sh",27,"sh27",32]
["sh",28,"sh28",32]
["sh",29,"sh29",32]
["sh",30,"sh30",32]
["sh",31,"sh31",56]
["sh",32,"sh32",56]
["sh",33,{"$f":"CONCATENATE(A530,B530)","v":"sh33"},56]
["sh",34,"sh34",56]
["sh",35,"sh35",56]
["sh",36,"sh36",56]
["sh",37,"sh37",56]
["sh",38,"sh38",56]
["sh",39,"sh39",56]
["sh",40,"sh40",56]
["sh",41,"sh41",56]
["sh",42,"sh42",56]
["sh",43,"sh43",56]
["sh",44,"sh44",56]
["sh",45,"sh45",56]
["sh",46,"sh46",56]
["sh",47,"sh47",56]
["sh",48,"sh48",56]
["sh",49,{"$f":"CONCATENATE(A546,B546)","v":"sh49"},56]
["sh",50,"sh50",56]
["sh",51,"sh51",84]
["sh",52,"sh52",84]
["sh",53,{"$f":"CONCATENATE(A550,B550)","v":"sh53"},84]
["sh",54,{"$f":"CONCATENATE(A551,B551)","v":"sh54"},84]
["sh",55,{"$f":"CONCATENATE(A552,B552)","v":"sh55"},84]
["sh",56,"sh56",120]
["sh",57,"sh57",120]
["sh",58,"sh58",120]
["sh",59,"sh59",120]
["sh",60,"sh60",120]
["sh",61,{"$f":"CONCATENATE(A558,B558)","v":"sh61"},160]
["sh",62,{"$f":"CONCATENATE(A559,B559)","v":"sh62"},160]
["sh",63,{"$f":"CONCATENATE(A560,B560)","v":"sh63"},160]
["sh",64,"sh64",160]
["sh",65,"sh65",160]
["sh",66,"sh66",160]
["sh",67,"sh67",160]
["sh",68,"sh68",160]
["sh",69,"sh69",160]
["sh",70,"sh70",160]
["sh",71,"sh71",236]
["sh",72,"sh72",236]
["sh",73,{"$f":"CONCATENATE(A570,B570)","v":"sh73"},236]
["sh",74,"sh74",236]
["sh",75,"sh75",236]
["sh",76,"sh76",236]
["sh",77,"sh77",236]
["sh",78,"sh78",236]
["sh",79,"sh79",236]
["sh",80,"sh80",236]
["sh",81,"sh81",332]
["sh",82,"sh82",332]
["sh",83,"sh83",332]
["sh",84,"sh84",332]
["sh",85,"sh85",332]
["sh",86,"sh86",332]
["sh",87,"sh87",332]
["sh",88,"sh88",332]
["sh",89,"sh89",332]
["sh",90,"sh90",332]
["d",18,"d18",56]
["d",19,"d19",56]
["d",20,"d20",56]
["d",21,"d21",56]
["d",22,"d22",56]
["d",23,"d23",56]
["d",24,{"$f":"CONCATENATE(A594,B594)","v":"d24"},56]
["d",25,"d25",56]
["d",26,"d26",56]
["d",27,"d27",56]
["d",28,"d28",56]
["d",29,"d29",56]
["d",30,"d30",56]
["d",31,"d31",56]
["d",32,"d32",56]
["d",33,"d33",56]
["d",34,"d34",56]
["d",35,"d35",56]
["d",36,"d36",56]
["d",37,"d37",56]
["d",38,"d38",80]
["d",39,{"$f":"CONCATENATE(A609,B609)","v":"d39"},80]
["d",40,"d40",80]
["d",41,"d41",80]
["d",42,"d42",80]
["d",43,"d43",80]
["d",44,"d44",80]
["d",45,"d45",96]
["d",46,{"$f":"CONCATENATE(A616,B616)","v":"d46"},96]
["d",47,"d47",96]
["d",48,"d48",96]
["d",49,"d49",96]
["d",50,"d50",96]
["d",51,"d51",112]
["d",52,"d52",112]
["d",53,"d53",112]
["d",54,"d54",112]
["d",55,"d55",112]
["d",56,"d56",124]
["d",57,"d57",124]
["d",58,"d58",124]
["d",59,"d59",124]
["d",60,"d60",124]
["d",61,"d61",124]
["d",62,"d62",124]
["d",63,"d63",124]
["d",64,"d64",124]
["d",65,"d65",124]
["d",66,{"$f":"CONCATENATE(A636,B636)","v":"d66"},124]
["d",67,"d67",124]
["d",68,"d68",124]
["d",69,"d69",124]
["d",70,"d70",124]
["d",71,"d71",124]
["d",72,"d72",124]
["d",73,"d73",124]
["d",74,"d74",124]
["d",75,"d75",124]
["d",76,"d76",124]
["d",77,"d77",124]
["d",78,"d78",124]
["d",79,"d79",124]
["d",80,{"$f":"CONCATENATE(A650,B650)","v":"d80"},124]
["d",81,"d81",124]
["d",82,"d82",124]
["d",83,"d83",124]
["d",84,"d84",124]
["d",85,"d85",124]
["d",86,"d86",124]
["d",87,"d87",124]
["d",88,"d88",124]
["d",89,"d89",124]
["d",90,"d90",124]
["d",91,"d91",124]
["d",92,"d92",124]
["d",93,"d93",124]
["d",94,"d94",124]
["d",95,"d95",124]
["d",96,"d96",124]
["d",97,"d97",124]
["d",98,"d98",124]
["d",99,"d99",124]
["d",100,"d100",124]
["g",null,{"$f":"CONCATENATE(A671,B671)","v":"g"},32]

{"sheet":"Past Winners","index":32,"n_rows":12,"n_cols":3,"rows_kept":12,"cut":false,"hidden":false,"merged":[]}
[]
[]
[]
[]
[null,2013,"IAN BOWELL"]
[null,2014,"MIKE WATTS"]
[null,2015,"ROB TUCK"]
[null,2016,"ANDY COLLIER"]
[null,2017,"SIMON DRAYTON"]
[null,2018,"DARREN BOND"]
[null,2019,"GARRY HUTSON"]
[null,"2020-21","ROB TUCK"]